{"text_format":"3","workbook":"xlsx","n_sheets":4,"sheets":["2022-11-29-N1500","2022-11-29-STB-L3","2022-11-29-STB-L2","Hilfe"],"not_rendered":{"macros":1,"defined_names":6},"read":"whole","date_system":"1900"}

{"sheet":"2022-11-29-N1500","index":0,"n_rows":206,"n_cols":26,"rows_kept":206}
["Turnier:",null,"https://lichess.org/tournament/rxA9ejuZ"]
["Datum:",null,"2022-11-29"]
["Bed.Zeit:",null,"5/3"]
["Berserker:",null,"N","(J/N)"]
["Arenastr:",null,"N","(J/N)"]
["Rang","Titel","Benutzername","Elo","Pkt.","Perf.","Team","Anzahl\nPartien","Bers.\n%","Partien Resultate","Check\nPunkte","Check\nAnzahl\nPartien","Part.","Win","Remis","Arena\nRemis","Lose","Total Berserker","Tot.\nBers.","Bers.\nWin","Bers.\nRemis\n Lose","Arena\nStrikes","Pkt.","Faktor\nPerformance\ngeteilt durch\nElozahl","Elo Zuwachs\nPerformance\nminus Elozahl"]
[1,"","Galaxxion",1493,11,1715,"zuzwil-sg-ch",6,{"v":0,"d":"0%"},"222122",{"$f":"IF(W7=E7,\"OK\",\"Falsch\")","v":"OK"},{"$f":"IF(H7=0,\"\",IF(M7=H7,\"OK\",\"Falsch\"))","v":"OK"},{"$f":"LEN(J7)","v":6},{"$f":"M7-(M7-LEN(SUBSTITUTE(J7,\"0\",\"\")))-(M7-LEN(SUBSTITUTE(J7,\"1\",\"\")))-P7","v":5},{"$f":"M7-LEN(SUBSTITUTE(J7,\"1\",\"\"))+P7","v":1},{"$f":"IF($Z$7=\"J\",(M7-LEN(SUBSTITUTE(J7,\"42\",\"\")))/2+(M7-LEN(SUBSTITUTE(J7,\"222\",\"\")))/3,0)","v":0},{"$f":"M7-LEN(SUBSTITUTE(J7,\"0\",\"\"))","v":0},{"$f":"I7*M7","v":0},{"$f":"ROUND(R7,0)","v":0},{"$f":"M7-(M7-(LEN(J7)-LEN(SUBSTITUTE(J7,\"3\",\"\"))))+M7-(M7-(LEN(J7)-LEN(SUBSTITUTE(J7,\"5\",\"\"))))","v":0},{"$f":"S7-T7","v":0},{"$f":"M7-(M7-(LEN(J7)-LEN(SUBSTITUTE(J7,\"4\",\"\"))))+M7-(M7-(LEN(J7)-LEN(SUBSTITUTE(J7,\"5\",\"\"))))","v":0},{"$f":"SUM(MID(J7,ROW(INDIRECT(\"h1:H\"&LEN(J7))),1)*1)","v":11},{"$f":"F7/D7","v":{"v":1.1486939048894842,"d":"1.15"}},{"$f":"F7-D7","v":222},{"$f":"C5","v":"N"}]
[2,"","alviskniuras",1493,11,1575,"ladja",7,{"v":0,"d":"0%"},"2022122","OK",{"$f":"IF(H8=0,\"\",IF(M8=H8,\"OK\",\"Falsch\"))","v":"OK"},7,{"$f":"M8-(M8-LEN(SUBSTITUTE(J8,\"0\",\"\")))-(M8-LEN(SUBSTITUTE(J8,\"1\",\"\")))-P8","v":5},1,{"$f":"IF($Z$7=\"J\",(M8-LEN(SUBSTITUTE(J8,\"42\",\"\")))/2+(M8-LEN(SUBSTITUTE(J8,\"222\",\"\")))/3,0)","v":0},1,0,{"$f":"ROUND(R8,0)","v":0},0,{"$f":"S8-T8","v":0},0,{"$f":"SUM(MID(J8,ROW(INDIRECT(\"h1:H\"&LEN(J8))),1)*1)","v":11},{"$f":"F8/D8","v":{"v":1.0549229738780979,"d":"1.05"}},{"$f":"F8-D8","v":82}]
[3,"","Kassym64",1083,11,1386,"ladja",7,{"v":0,"d":"0%"},"1220222","OK","OK",7,5,1,0,1,0,0,0,0,0,{"$f":"SUM(MID(J9,ROW(INDIRECT(\"h1:H\"&LEN(J9))),1)*1)","v":11},{"v":1.2797783933518005,"d":"1.28"},303]
[4,"","OneDay9a",1529,10,1476,"prattelnschach",7,{"v":0,"d":"0%"},"0222220","OK","OK",7,5,0,0,2,0,0,0,0,0,{"$f":"SUM(MID(J10,ROW(INDIRECT(\"h1:H\"&LEN(J10))),1)*1)","v":10},{"v":0.9653368214519293,"d":"0.97"},{"v":-53,"d":"-53 "}]
[5,"","joan3112",1164,8,1250,"ladja",7,{"v":0,"d":"0%"},"2220200","OK","OK",7,4,0,0,3,0,0,0,0,0,{"$f":"SUM(MID(J11,ROW(INDIRECT(\"h1:H\"&LEN(J11))),1)*1)","v":8},{"v":1.0738831615120275,"d":"1.07"},86]
[6,"","DSol11",1223,8,1224,"zuzwil-sg-ch",7,{"v":0,"d":"0%"},"2020202","OK","OK",7,4,0,0,3,0,0,0,0,0,{"$f":"SUM(MID(J12,ROW(INDIRECT(\"h1:H\"&LEN(J12))),1)*1)","v":8},{"v":1.0008176614881439,"d":"1.00"},1]
[7,"","Blackvolvo",1170,8,1079,"prattelnschach",8,{"v":0,"d":"0%"},"22020200","OK","OK",8,4,0,0,4,0,0,0,0,0,{"$f":"SUM(MID(J13,ROW(INDIRECT(\"h1:H\"&LEN(J13))),1)*1)","v":8},{"v":0.9222222222222223,"d":"0.92"},{"v":-91,"d":"-91 "}]
[8,"","IljaMitrovic",903,8,903,"ladja",12,{"v":0,"d":"0%"},"200002200002","OK","OK",12,4,0,0,8,0,0,0,0,0,{"$f":"SUM(MID(J14,ROW(INDIRECT(\"h1:H\"&LEN(J14))),1)*1)","v":8},{"v":1,"d":"1.00"},0]
[9,"","nik842",1105,7,1214,"sprengschach-turm",6,{"v":0,"d":"0%"},"102022","OK","OK",6,3,1,0,2,0,0,0,0,0,{"$f":"SUM(MID(J15,ROW(INDIRECT(\"h1:H\"&LEN(J15))),1)*1)","v":7},{"v":1.0986425339366517,"d":"1.10"},109]
[10,"","Robin-SB",993,7,959,"schwarzenbach-sg",9,{"v":0,"d":"0%"},"002120020","OK","OK",9,3,1,0,5,0,0,0,0,0,{"$f":"SUM(MID(J16,ROW(INDIRECT(\"h1:H\"&LEN(J16))),1)*1)","v":7},{"v":0.9657603222557906,"d":"0.97"},{"v":-34,"d":"-34 "}]
[11,"","chesserlion007",999,6,923,"ladja",8,{"v":0,"d":"0%"},"20020200","OK","OK",8,3,0,0,5,0,0,0,0,0,{"$f":"SUM(MID(J17,ROW(INDIRECT(\"h1:H\"&LEN(J17))),1)*1)","v":6},{"v":0.923923923923924,"d":"0.92"},{"v":-76,"d":"-76 "}]
[12,"","hapewe",1097,6,901,"plankenli",7,{"v":0,"d":"0%"},"2000022","OK","OK",7,3,0,0,4,0,0,0,0,0,{"$f":"SUM(MID(J18,ROW(INDIRECT(\"h1:H\"&LEN(J18))),1)*1)","v":6},{"v":0.821330902461258,"d":"0.82"},{"v":-196,"d":"-196 "}]
[13,"","Lomaster13",1004,6,846,"prattelnschach",7,{"v":0,"d":"0%"},"0202020","OK","OK",7,3,0,0,4,0,0,0,0,0,{"$f":"SUM(MID(J19,ROW(INDIRECT(\"h1:H\"&LEN(J19))),1)*1)","v":6},{"v":0.8426294820717132,"d":"0.84"},{"v":-158,"d":"-158 "}]
[14,"","domast",778,6,814,"schwarzenbach-sg",10,{"v":0,"d":"0%"},"0200000202","OK","OK",10,3,0,0,7,0,0,0,0,0,{"$f":"SUM(MID(J20,ROW(INDIRECT(\"h1:H\"&LEN(J20))),1)*1)","v":6},{"v":1.0462724935732648,"d":"1.05"},36]
[15,"","noahKoenig",1204,4,1103,"schwarzenbach-sg",7,{"v":0,"d":"0%"},"0202000","OK","OK",7,2,0,0,5,0,0,0,0,0,{"$f":"SUM(MID(J21,ROW(INDIRECT(\"h1:H\"&LEN(J21))),1)*1)","v":4},{"v":0.9161129568106312,"d":"0.92"},{"v":-101,"d":"-101 "}]
[16,"","Spikeleo",1164,4,963,"sprengschach-turm",6,{"v":0,"d":"0%"},"000220","OK","OK",6,2,0,0,4,0,0,0,0,0,{"$f":"SUM(MID(J22,ROW(INDIRECT(\"h1:H\"&LEN(J22))),1)*1)","v":4},{"v":0.8273195876288659,"d":"0.83"},{"v":-201,"d":"-201 "}]
[17,"","mena12",863,3,1203,"sprengschach-turm",2,{"v":0,"d":"0%"},"21","OK","OK",2,1,1,0,0,0,0,0,0,0,{"$f":"SUM(MID(J23,ROW(INDIRECT(\"h1:H\"&LEN(J23))),1)*1)","v":3},{"v":1.3939745075318657,"d":"1.39"},340]
[18,"","Anay_12",996,2,1266,"ladja",1,{"v":0,"d":"0%"},"2","OK","OK",1,1,0,0,0,0,0,0,0,0,{"$f":"SUM(MID(J24,ROW(INDIRECT(\"h1:H\"&LEN(J24))),1)*1)","v":2},{"v":1.2710843373493976,"d":"1.27"},270]
[19,"","Floris2006",621,2,771,"kirchberg-sg-ch",3,{"v":0,"d":"0%"},"200","OK","OK",3,1,0,0,2,0,0,0,0,0,{"$f":"SUM(MID(J25,ROW(INDIRECT(\"h1:H\"&LEN(J25))),1)*1)","v":2},{"v":1.2415458937198067,"d":"1.24"},150]
[20,"","varunesh64",1031,0,261,"sprengschach-turm",1,{"v":0,"d":"0%"},"0","OK","OK",1,0,0,0,1,0,0,0,0,0,{"$f":"SUM(MID(J26,ROW(INDIRECT(\"h1:H\"&LEN(J26))),1)*1)","v":0},{"v":0.25315227934044615,"d":"0.25"},{"v":-770,"d":"-770 "}]
[21,{"$nulls":7},{"v":0,"d":"0%"},null,{"$error":"#REF!"},"",0,0,0,0,0,0,0,0,0,0,{"$f":"SUM(MID(J27,ROW(INDIRECT(\"h1:H\"&LEN(J27))),1)*1)","v":{"$error":"#REF!"}},{"$error":"#DIV/0!"},0]
[22,{"$nulls":7},{"v":0,"d":"0%"},null,{"$error":"#REF!"},"",0,0,0,0,0,0,0,0,0,0,{"$f":"SUM(MID(J28,ROW(INDIRECT(\"h1:H\"&LEN(J28))),1)*1)","v":{"$error":"#REF!"}},{"$error":"#DIV/0!"},0]
[23,{"$nulls":7},{"v":0,"d":"0%"},null,{"$error":"#REF!"},"",0,0,0,0,0,0,0,0,0,0,{"$f":"SUM(MID(J29,ROW(INDIRECT(\"h1:H\"&LEN(J29))),1)*1)","v":{"$error":"#REF!"}},{"$error":"#DIV/0!"},0]
[24,{"$nulls":7},{"v":0,"d":"0%"},null,{"$error":"#REF!"},"",0,0,0,0,0,0,0,0,0,0,{"$f":"SUM(MID(J30,ROW(INDIRECT(\"h1:H\"&LEN(J30))),1)*1)","v":{"$error":"#REF!"}},{"$error":"#DIV/0!"},0]
[25,{"$nulls":7},{"v":0,"d":"0%"},null,{"$error":"#REF!"},"",0,0,0,0,0,0,0,0,0,0,{"$f":"SUM(MID(J31,ROW(INDIRECT(\"h1:H\"&LEN(J31))),1)*1)","v":{"$error":"#REF!"}},{"$error":"#DIV/0!"},0]
[26,{"$nulls":7},{"v":0,"d":"0%"},null,{"$error":"#REF!"},"",0,0,0,0,0,0,0,0,0,0,{"$f":"SUM(MID(J32,ROW(INDIRECT(\"h1:H\"&LEN(J32))),1)*1)","v":{"$error":"#REF!"}},{"$error":"#DIV/0!"},0]
[27,{"$nulls":7},{"v":0,"d":"0%"},null,{"$error":"#REF!"},"",0,0,0,0,0,0,0,0,0,0,{"$f":"SUM(MID(J33,ROW(INDIRECT(\"h1:H\"&LEN(J33))),1)*1)","v":{"$error":"#REF!"}},{"$error":"#DIV/0!"},0]
[28,{"$nulls":7},{"v":0,"d":"0%"},null,{"$error":"#REF!"},"",0,0,0,0,0,0,0,0,0,0,{"$f":"SUM(MID(J34,ROW(INDIRECT(\"h1:H\"&LEN(J34))),1)*1)","v":{"$error":"#REF!"}},{"$error":"#DIV/0!"},0]
[29,{"$nulls":7},{"v":0,"d":"0%"},null,{"$error":"#REF!"},"",0,0,0,0,0,0,0,0,0,0,{"$f":"SUM(MID(J35,ROW(INDIRECT(\"h1:H\"&LEN(J35))),1)*1)","v":{"$error":"#REF!"}},{"$error":"#DIV/0!"},0]
[30,{"$nulls":7},{"v":0,"d":"0%"},null,{"$error":"#REF!"},"",0,0,0,0,0,0,0,0,0,0,{"$f":"SUM(MID(J36,ROW(INDIRECT(\"h1:H\"&LEN(J36))),1)*1)","v":{"$error":"#REF!"}},{"$error":"#DIV/0!"},0]
[31,{"$nulls":7},{"v":0,"d":"0%"},null,{"$error":"#REF!"},"",0,0,0,0,0,0,0,0,0,0,{"$f":"SUM(MID(J37,ROW(INDIRECT(\"h1:H\"&LEN(J37))),1)*1)","v":{"$error":"#REF!"}},{"$error":"#DIV/0!"},0]
[32,{"$nulls":7},{"v":0,"d":"0%"},null,{"$error":"#REF!"},"",0,0,0,0,0,0,0,0,0,0,{"$f":"SUM(MID(J38,ROW(INDIRECT(\"h1:H\"&LEN(J38))),1)*1)","v":{"$error":"#REF!"}},{"$error":"#DIV/0!"},0]
[33,{"$nulls":7},{"v":0,"d":"0%"},null,{"$error":"#REF!"},"",0,0,0,0,0,0,0,0,0,0,{"$f":"SUM(MID(J39,ROW(INDIRECT(\"h1:H\"&LEN(J39))),1)*1)","v":{"$error":"#REF!"}},{"$error":"#DIV/0!"},0]
[34,{"$nulls":7},{"v":0,"d":"0%"},null,{"$error":"#REF!"},"",0,0,0,0,0,0,0,0,0,0,{"$f":"SUM(MID(J40,ROW(INDIRECT(\"h1:H\"&LEN(J40))),1)*1)","v":{"$error":"#REF!"}},{"$error":"#DIV/0!"},0]
[35,{"$nulls":7},{"v":0,"d":"0%"},null,{"$error":"#REF!"},"",0,0,0,0,0,0,0,0,0,0,{"$f":"SUM(MID(J41,ROW(INDIRECT(\"h1:H\"&LEN(J41))),1)*1)","v":{"$error":"#REF!"}},{"$error":"#DIV/0!"},0]
[36,{"$nulls":7},{"v":0,"d":"0%"},null,{"$error":"#REF!"},"",0,0,0,0,0,0,0,0,0,0,{"$f":"SUM(MID(J42,ROW(INDIRECT(\"h1:H\"&LEN(J42))),1)*1)","v":{"$error":"#REF!"}},{"$error":"#DIV/0!"},0]
[37,{"$nulls":7},{"v":0,"d":"0%"},null,{"$error":"#REF!"},"",0,0,0,0,0,0,0,0,0,0,{"$f":"SUM(MID(J43,ROW(INDIRECT(\"h1:H\"&LEN(J43))),1)*1)","v":{"$error":"#REF!"}},{"$error":"#DIV/0!"},0]
[38,{"$nulls":7},{"v":0,"d":"0%"},null,{"$error":"#REF!"},"",0,0,0,0,0,0,0,0,0,0,{"$f":"SUM(MID(J44,ROW(INDIRECT(\"h1:H\"&LEN(J44))),1)*1)","v":{"$error":"#REF!"}},{"$error":"#DIV/0!"},0]
[39,{"$nulls":7},{"v":0,"d":"0%"},null,{"$error":"#REF!"},"",0,0,0,0,0,0,0,0,0,0,{"$f":"SUM(MID(J45,ROW(INDIRECT(\"h1:H\"&LEN(J45))),1)*1)","v":{"$error":"#REF!"}},{"$error":"#DIV/0!"},0]
[40,{"$nulls":7},{"v":0,"d":"0%"},null,{"$error":"#REF!"},"",0,0,0,0,0,0,0,0,0,0,{"$f":"SUM(MID(J46,ROW(INDIRECT(\"h1:H\"&LEN(J46))),1)*1)","v":{"$error":"#REF!"}},{"$error":"#DIV/0!"},0]
[{"$nulls":8},{"v":0,"d":"0%"},null,{"$error":"#REF!"},"",0,0,0,0,0,0,0,0,0,0,{"$f":"SUM(MID(J47,ROW(INDIRECT(\"h1:H\"&LEN(J47))),1)*1)","v":{"$error":"#REF!"}},{"$error":"#DIV/0!"},0]
[{"$nulls":8},{"v":0,"d":"0%"},null,{"$error":"#REF!"},"",0,0,0,0,0,0,0,0,0,0,{"$f":"SUM(MID(J48,ROW(INDIRECT(\"h1:H\"&LEN(J48))),1)*1)","v":{"$error":"#REF!"}},{"$error":"#DIV/0!"},0]
[{"$nulls":8},{"v":0,"d":"0%"},null,{"$error":"#REF!"},"",0,0,0,0,0,0,0,0,0,0,{"$f":"SUM(MID(J49,ROW(INDIRECT(\"h1:H\"&LEN(J49))),1)*1)","v":{"$error":"#REF!"}},{"$error":"#DIV/0!"},0]
[{"$nulls":8},{"v":0,"d":"0%"},null,{"$error":"#REF!"},"",0,0,0,0,0,0,0,0,0,0,{"$f":"SUM(MID(J50,ROW(INDIRECT(\"h1:H\"&LEN(J50))),1)*1)","v":{"$error":"#REF!"}},{"$error":"#DIV/0!"},0]
[{"$nulls":8},{"v":0,"d":"0%"},null,{"$error":"#REF!"},"",0,0,0,0,0,0,0,0,0,0,{"$f":"SUM(MID(J51,ROW(INDIRECT(\"h1:H\"&LEN(J51))),1)*1)","v":{"$error":"#REF!"}},{"$error":"#DIV/0!"},0]
[{"$nulls":8},{"v":0,"d":"0%"},null,{"$error":"#REF!"},"",0,0,0,0,0,0,0,0,0,0,{"$f":"SUM(MID(J52,ROW(INDIRECT(\"h1:H\"&LEN(J52))),1)*1)","v":{"$error":"#REF!"}},{"$error":"#DIV/0!"},0]
[{"$nulls":8},{"v":0,"d":"0%"},null,{"$error":"#REF!"},"",0,0,0,0,0,0,0,0,0,0,{"$f":"SUM(MID(J53,ROW(INDIRECT(\"h1:H\"&LEN(J53))),1)*1)","v":{"$error":"#REF!"}},{"$error":"#DIV/0!"},0]
[{"$nulls":8},{"v":0,"d":"0%"},null,{"$error":"#REF!"},"",0,0,0,0,0,0,0,0,0,0,{"$f":"SUM(MID(J54,ROW(INDIRECT(\"h1:H\"&LEN(J54))),1)*1)","v":{"$error":"#REF!"}},{"$error":"#DIV/0!"},0]
[{"$nulls":8},{"v":0,"d":"0%"},null,{"$error":"#REF!"},"",0,0,0,0,0,0,0,0,0,0,{"$f":"SUM(MID(J55,ROW(INDIRECT(\"h1:H\"&LEN(J55))),1)*1)","v":{"$error":"#REF!"}},{"$error":"#DIV/0!"},0]
[{"$nulls":8},{"v":0,"d":"0%"},null,{"$error":"#REF!"},"",0,0,0,0,0,0,0,0,0,0,{"$f":"SUM(MID(J56,ROW(INDIRECT(\"h1:H\"&LEN(J56))),1)*1)","v":{"$error":"#REF!"}},{"$error":"#DIV/0!"},0]
[{"$nulls":8},{"v":0,"d":"0%"},null,{"$error":"#REF!"},"",0,0,0,0,0,0,0,0,0,0,{"$f":"SUM(MID(J57,ROW(INDIRECT(\"h1:H\"&LEN(J57))),1)*1)","v":{"$error":"#REF!"}},{"$error":"#DIV/0!"},0]
[{"$nulls":8},{"v":0,"d":"0%"},null,{"$error":"#REF!"},"",0,0,0,0,0,0,0,0,0,0,{"$f":"SUM(MID(J58,ROW(INDIRECT(\"h1:H\"&LEN(J58))),1)*1)","v":{"$error":"#REF!"}},{"$error":"#DIV/0!"},0]
[{"$nulls":8},{"v":0,"d":"0%"},null,{"$error":"#REF!"},"",0,0,0,0,0,0,0,0,0,0,{"$f":"SUM(MID(J59,ROW(INDIRECT(\"h1:H\"&LEN(J59))),1)*1)","v":{"$error":"#REF!"}},{"$error":"#DIV/0!"},0]
[{"$nulls":8},{"v":0,"d":"0%"},null,{"$error":"#REF!"},"",0,0,0,0,0,0,0,0,0,0,{"$f":"SUM(MID(J60,ROW(INDIRECT(\"h1:H\"&LEN(J60))),1)*1)","v":{"$error":"#REF!"}},{"$error":"#DIV/0!"},0]
[{"$nulls":8},{"v":0,"d":"0%"},null,{"$error":"#REF!"},"",0,0,0,0,0,0,0,0,0,0,{"$f":"SUM(MID(J61,ROW(INDIRECT(\"h1:H\"&LEN(J61))),1)*1)","v":{"$error":"#REF!"}},{"$error":"#DIV/0!"},0]
[{"$nulls":8},{"v":0,"d":"0%"},null,{"$error":"#REF!"},"",0,0,0,0,0,0,0,0,0,0,{"$f":"SUM(MID(J62,ROW(INDIRECT(\"h1:H\"&LEN(J62))),1)*1)","v":{"$error":"#REF!"}},{"$error":"#DIV/0!"},0]
[{"$nulls":8},{"v":0,"d":"0%"},null,{"$error":"#REF!"},"",0,0,0,0,0,0,0,0,0,0,{"$f":"SUM(MID(J63,ROW(INDIRECT(\"h1:H\"&LEN(J63))),1)*1)","v":{"$error":"#REF!"}},{"$error":"#DIV/0!"},0]
[{"$nulls":8},{"v":0,"d":"0%"},null,{"$error":"#REF!"},"",0,0,0,0,0,0,0,0,0,0,{"$f":"SUM(MID(J64,ROW(INDIRECT(\"h1:H\"&LEN(J64))),1)*1)","v":{"$error":"#REF!"}},{"$error":"#DIV/0!"},0]
[{"$nulls":8},{"v":0,"d":"0%"},null,{"$error":"#REF!"},"",0,0,0,0,0,0,0,0,0,0,{"$f":"SUM(MID(J65,ROW(INDIRECT(\"h1:H\"&LEN(J65))),1)*1)","v":{"$error":"#REF!"}},{"$error":"#DIV/0!"},0]
[{"$nulls":8},{"v":0,"d":"0%"},null,{"$error":"#REF!"},"",0,0,0,0,0,0,0,0,0,0,{"$f":"SUM(MID(J66,ROW(INDIRECT(\"h1:H\"&LEN(J66))),1)*1)","v":{"$error":"#REF!"}},{"$error":"#DIV/0!"},0]
[{"$nulls":8},{"v":0,"d":"0%"},null,{"$error":"#REF!"},"",0,0,0,0,0,0,0,0,0,0,{"$f":"SUM(MID(J67,ROW(INDIRECT(\"h1:H\"&LEN(J67))),1)*1)","v":{"$error":"#REF!"}},{"$error":"#DIV/0!"},0]
[{"$nulls":8},{"v":0,"d":"0%"},null,{"$error":"#REF!"},"",0,0,0,0,0,0,0,0,0,0,{"$f":"SUM(MID(J68,ROW(INDIRECT(\"h1:H\"&LEN(J68))),1)*1)","v":{"$error":"#REF!"}},{"$error":"#DIV/0!"},0]
[{"$nulls":8},{"v":0,"d":"0%"},null,{"$error":"#REF!"},"",0,0,0,0,0,0,0,0,0,0,{"$f":"SUM(MID(J69,ROW(INDIRECT(\"h1:H\"&LEN(J69))),1)*1)","v":{"$error":"#REF!"}},{"$error":"#DIV/0!"},0]
[{"$nulls":8},{"v":0,"d":"0%"},null,{"$error":"#REF!"},"",0,0,0,0,0,0,0,0,0,0,{"$f":"SUM(MID(J70,ROW(INDIRECT(\"h1:H\"&LEN(J70))),1)*1)","v":{"$error":"#REF!"}},{"$error":"#DIV/0!"},0]
[{"$nulls":8},{"v":0,"d":"0%"},null,{"$f":"IF(W71=E71,\"OK\",\"Falsch\")","v":{"$error":"#REF!"}},"",{"$f":"LEN(J71)","v":0},0,{"$f":"M71-LEN(SUBSTITUTE(J71,\"1\",\"\"))+P71","v":0},0,{"$f":"M71-LEN(SUBSTITUTE(J71,\"0\",\"\"))","v":0},{"$f":"I71*M71","v":0},0,{"$f":"M71-(M71-(LEN(J71)-LEN(SUBSTITUTE(J71,\"3\",\"\"))))+M71-(M71-(LEN(J71)-LEN(SUBSTITUTE(J71,\"5\",\"\"))))","v":0},0,{"$f":"M71-(M71-(LEN(J71)-LEN(SUBSTITUTE(J71,\"4\",\"\"))))+M71-(M71-(LEN(J71)-LEN(SUBSTITUTE(J71,\"5\",\"\"))))","v":0},{"$f":"SUM(MID(J71,ROW(INDIRECT(\"h1:H\"&LEN(J71))),1)*1)","v":{"$error":"#REF!"}},{"$error":"#DIV/0!"},0]
[{"$nulls":8},{"v":0,"d":"0%"},null,{"$error":"#REF!"},{"$f":"IF(H72=0,\"\",IF(M72=H72,\"OK\",\"Falsch\"))","v":""},0,{"$f":"M72-(M72-LEN(SUBSTITUTE(J72,\"0\",\"\")))-(M72-LEN(SUBSTITUTE(J72,\"1\",\"\")))-P72","v":0},0,{"$f":"IF($Z$7=\"J\",(M72-LEN(SUBSTITUTE(J72,\"42\",\"\")))/2+(M72-LEN(SUBSTITUTE(J72,\"222\",\"\")))/3,0)","v":0},0,0,{"$f":"ROUND(R72,0)","v":0},0,{"$f":"S72-T72","v":0},0,{"$f":"SUM(MID(J72,ROW(INDIRECT(\"h1:H\"&LEN(J72))),1)*1)","v":{"$error":"#REF!"}},{"$f":"F72/D72","v":{"$error":"#DIV/0!"}},{"$f":"F72-D72","v":0}]
[{"$nulls":8},{"v":0,"d":"0%"},null,{"$error":"#REF!"},"",0,0,0,0,0,0,0,0,0,0,{"$f":"SUM(MID(J73,ROW(INDIRECT(\"h1:H\"&LEN(J73))),1)*1)","v":{"$error":"#REF!"}},{"$error":"#DIV/0!"},0]
[{"$nulls":8},{"v":0,"d":"0%"},null,{"$error":"#REF!"},"",0,0,0,0,0,0,0,0,0,0,{"$f":"SUM(MID(J74,ROW(INDIRECT(\"h1:H\"&LEN(J74))),1)*1)","v":{"$error":"#REF!"}},{"$error":"#DIV/0!"},0]
[{"$nulls":8},{"v":0,"d":"0%"},null,{"$error":"#REF!"},"",0,0,0,0,0,0,0,0,0,0,{"$f":"SUM(MID(J75,ROW(INDIRECT(\"h1:H\"&LEN(J75))),1)*1)","v":{"$error":"#REF!"}},{"$error":"#DIV/0!"},0]
[{"$nulls":8},{"v":0,"d":"0%"},null,{"$error":"#REF!"},"",0,0,0,0,0,0,0,0,0,0,{"$f":"SUM(MID(J76,ROW(INDIRECT(\"h1:H\"&LEN(J76))),1)*1)","v":{"$error":"#REF!"}},{"$error":"#DIV/0!"},0]
[{"$nulls":8},{"v":0,"d":"0%"},null,{"$error":"#REF!"},"",0,0,0,0,0,0,0,0,0,0,{"$f":"SUM(MID(J77,ROW(INDIRECT(\"h1:H\"&LEN(J77))),1)*1)","v":{"$error":"#REF!"}},{"$error":"#DIV/0!"},0]
[{"$nulls":8},{"v":0,"d":"0%"},null,{"$error":"#REF!"},"",0,0,0,0,0,0,0,0,0,0,{"$f":"SUM(MID(J78,ROW(INDIRECT(\"h1:H\"&LEN(J78))),1)*1)","v":{"$error":"#REF!"}},{"$error":"#DIV/0!"},0]
[{"$nulls":8},{"v":0,"d":"0%"},null,{"$error":"#REF!"},"",0,0,0,0,0,0,0,0,0,0,{"$f":"SUM(MID(J79,ROW(INDIRECT(\"h1:H\"&LEN(J79))),1)*1)","v":{"$error":"#REF!"}},{"$error":"#DIV/0!"},0]
[{"$nulls":8},{"v":0,"d":"0%"},null,{"$error":"#REF!"},"",0,0,0,0,0,0,0,0,0,0,{"$f":"SUM(MID(J80,ROW(INDIRECT(\"h1:H\"&LEN(J80))),1)*1)","v":{"$error":"#REF!"}},{"$error":"#DIV/0!"},0]
[{"$nulls":8},{"v":0,"d":"0%"},null,{"$error":"#REF!"},"",0,0,0,0,0,0,0,0,0,0,{"$f":"SUM(MID(J81,ROW(INDIRECT(\"h1:H\"&LEN(J81))),1)*1)","v":{"$error":"#REF!"}},{"$error":"#DIV/0!"},0]
[{"$nulls":8},{"v":0,"d":"0%"},null,{"$error":"#REF!"},"",0,0,0,0,0,0,0,0,0,0,{"$f":"SUM(MID(J82,ROW(INDIRECT(\"h1:H\"&LEN(J82))),1)*1)","v":{"$error":"#REF!"}},{"$error":"#DIV/0!"},0]
[{"$nulls":8},{"v":0,"d":"0%"},null,{"$error":"#REF!"},"",0,0,0,0,0,0,0,0,0,0,{"$f":"SUM(MID(J83,ROW(INDIRECT(\"h1:H\"&LEN(J83))),1)*1)","v":{"$error":"#REF!"}},{"$error":"#DIV/0!"},0]
[{"$nulls":8},{"v":0,"d":"0%"},null,{"$error":"#REF!"},"",0,0,0,0,0,0,0,0,0,0,{"$f":"SUM(MID(J84,ROW(INDIRECT(\"h1:H\"&LEN(J84))),1)*1)","v":{"$error":"#REF!"}},{"$error":"#DIV/0!"},0]
[{"$nulls":8},{"v":0,"d":"0%"},null,{"$error":"#REF!"},"",0,0,0,0,0,0,0,0,0,0,{"$f":"SUM(MID(J85,ROW(INDIRECT(\"h1:H\"&LEN(J85))),1)*1)","v":{"$error":"#REF!"}},{"$error":"#DIV/0!"},0]
[{"$nulls":8},{"v":0,"d":"0%"},null,{"$error":"#REF!"},"",0,0,0,0,0,0,0,0,0,0,{"$f":"SUM(MID(J86,ROW(INDIRECT(\"h1:H\"&LEN(J86))),1)*1)","v":{"$error":"#REF!"}},{"$error":"#DIV/0!"},0]
[{"$nulls":8},{"v":0,"d":"0%"},null,{"$error":"#REF!"},"",0,0,0,0,0,0,0,0,0,0,{"$f":"SUM(MID(J87,ROW(INDIRECT(\"h1:H\"&LEN(J87))),1)*1)","v":{"$error":"#REF!"}},{"$error":"#DIV/0!"},0]
[{"$nulls":8},{"v":0,"d":"0%"},null,{"$error":"#REF!"},"",0,0,0,0,0,0,0,0,0,0,{"$f":"SUM(MID(J88,ROW(INDIRECT(\"h1:H\"&LEN(J88))),1)*1)","v":{"$error":"#REF!"}},{"$error":"#DIV/0!"},0]
[{"$nulls":8},{"v":0,"d":"0%"},null,{"$error":"#REF!"},"",0,0,0,0,0,0,0,0,0,0,{"$f":"SUM(MID(J89,ROW(INDIRECT(\"h1:H\"&LEN(J89))),1)*1)","v":{"$error":"#REF!"}},{"$error":"#DIV/0!"},0]
[{"$nulls":8},{"v":0,"d":"0%"},null,{"$error":"#REF!"},"",0,0,0,0,0,0,0,0,0,0,{"$f":"SUM(MID(J90,ROW(INDIRECT(\"h1:H\"&LEN(J90))),1)*1)","v":{"$error":"#REF!"}},{"$error":"#DIV/0!"},0]
[{"$nulls":8},{"v":0,"d":"0%"},null,{"$error":"#REF!"},"",0,0,0,0,0,0,0,0,0,0,{"$f":"SUM(MID(J91,ROW(INDIRECT(\"h1:H\"&LEN(J91))),1)*1)","v":{"$error":"#REF!"}},{"$error":"#DIV/0!"},0]
[{"$nulls":8},{"v":0,"d":"0%"},null,{"$error":"#REF!"},"",0,0,0,0,0,0,0,0,0,0,{"$f":"SUM(MID(J92,ROW(INDIRECT(\"h1:H\"&LEN(J92))),1)*1)","v":{"$error":"#REF!"}},{"$error":"#DIV/0!"},0]
[{"$nulls":8},{"v":0,"d":"0%"},null,{"$error":"#REF!"},"",0,0,0,0,0,0,0,0,0,0,{"$f":"SUM(MID(J93,ROW(INDIRECT(\"h1:H\"&LEN(J93))),1)*1)","v":{"$error":"#REF!"}},{"$error":"#DIV/0!"},0]
[{"$nulls":8},{"v":0,"d":"0%"},null,{"$error":"#REF!"},"",0,0,0,0,0,0,0,0,0,0,{"$f":"SUM(MID(J94,ROW(INDIRECT(\"h1:H\"&LEN(J94))),1)*1)","v":{"$error":"#REF!"}},{"$error":"#DIV/0!"},0]
[{"$nulls":8},{"v":0,"d":"0%"},null,{"$error":"#REF!"},"",0,0,0,0,0,0,0,0,0,0,{"$f":"SUM(MID(J95,ROW(INDIRECT(\"h1:H\"&LEN(J95))),1)*1)","v":{"$error":"#REF!"}},{"$error":"#DIV/0!"},0]
[{"$nulls":8},{"v":0,"d":"0%"},null,{"$error":"#REF!"},"",0,0,0,0,0,0,0,0,0,0,{"$f":"SUM(MID(J96,ROW(INDIRECT(\"h1:H\"&LEN(J96))),1)*1)","v":{"$error":"#REF!"}},{"$error":"#DIV/0!"},0]
[{"$nulls":8},{"v":0,"d":"0%"},null,{"$error":"#REF!"},"",0,0,0,0,0,0,0,0,0,0,{"$f":"SUM(MID(J97,ROW(INDIRECT(\"h1:H\"&LEN(J97))),1)*1)","v":{"$error":"#REF!"}},{"$error":"#DIV/0!"},0]
[{"$nulls":8},{"v":0,"d":"0%"},null,{"$error":"#REF!"},"",0,0,0,0,0,0,0,0,0,0,{"$f":"SUM(MID(J98,ROW(INDIRECT(\"h1:H\"&LEN(J98))),1)*1)","v":{"$error":"#REF!"}},{"$error":"#DIV/0!"},0]
[{"$nulls":8},{"v":0,"d":"0%"},null,{"$error":"#REF!"},"",0,0,0,0,0,0,0,0,0,0,{"$f":"SUM(MID(J99,ROW(INDIRECT(\"h1:H\"&LEN(J99))),1)*1)","v":{"$error":"#REF!"}},{"$error":"#DIV/0!"},0]
[{"$nulls":8},{"v":0,"d":"0%"},null,{"$error":"#REF!"},"",0,0,0,0,0,0,0,0,0,0,{"$f":"SUM(MID(J100,ROW(INDIRECT(\"h1:H\"&LEN(J100))),1)*1)","v":{"$error":"#REF!"}},{"$error":"#DIV/0!"},0]
[{"$nulls":8},{"v":0,"d":"0%"},null,{"$error":"#REF!"},"",0,0,0,0,0,0,0,0,0,0,{"$f":"SUM(MID(J101,ROW(INDIRECT(\"h1:H\"&LEN(J101))),1)*1)","v":{"$error":"#REF!"}},{"$error":"#DIV/0!"},0]
[{"$nulls":8},{"v":0,"d":"0%"},null,{"$error":"#REF!"},"",0,0,0,0,0,0,0,0,0,0,{"$f":"SUM(MID(J102,ROW(INDIRECT(\"h1:H\"&LEN(J102))),1)*1)","v":{"$error":"#REF!"}},{"$error":"#DIV/0!"},0]
[{"$nulls":8},{"v":0,"d":"0%"},null,{"$error":"#REF!"},"",0,0,0,0,0,0,0,0,0,0,{"$f":"SUM(MID(J103,ROW(INDIRECT(\"h1:H\"&LEN(J103))),1)*1)","v":{"$error":"#REF!"}},{"$error":"#DIV/0!"},0]
[{"$nulls":8},{"v":0,"d":"0%"},null,{"$error":"#REF!"},"",0,0,0,0,0,0,0,0,0,0,{"$f":"SUM(MID(J104,ROW(INDIRECT(\"h1:H\"&LEN(J104))),1)*1)","v":{"$error":"#REF!"}},{"$error":"#DIV/0!"},0]
[{"$nulls":8},{"v":0,"d":"0%"},null,{"$error":"#REF!"},"",0,0,0,0,0,0,0,0,0,0,{"$f":"SUM(MID(J105,ROW(INDIRECT(\"h1:H\"&LEN(J105))),1)*1)","v":{"$error":"#REF!"}},{"$error":"#DIV/0!"},0]
[{"$nulls":8},{"v":0,"d":"0%"},null,{"$error":"#REF!"},"",0,0,0,0,0,0,0,0,0,0,{"$f":"SUM(MID(J106,ROW(INDIRECT(\"h1:H\"&LEN(J106))),1)*1)","v":{"$error":"#REF!"}},{"$error":"#DIV/0!"},0]
[{"$nulls":8},{"v":0,"d":"0%"},null,{"$error":"#REF!"},"",0,0,0,0,0,0,0,0,0,0,{"$f":"SUM(MID(J107,ROW(INDIRECT(\"h1:H\"&LEN(J107))),1)*1)","v":{"$error":"#REF!"}},{"$error":"#DIV/0!"},0]
[{"$nulls":8},{"v":0,"d":"0%"},null,{"$error":"#REF!"},"",0,0,0,0,0,0,0,0,0,0,{"$f":"SUM(MID(J108,ROW(INDIRECT(\"h1:H\"&LEN(J108))),1)*1)","v":{"$error":"#REF!"}},{"$error":"#DIV/0!"},0]
[{"$nulls":8},{"v":0,"d":"0%"},null,{"$error":"#REF!"},"",0,0,0,0,0,0,0,0,0,0,{"$f":"SUM(MID(J109,ROW(INDIRECT(\"h1:H\"&LEN(J109))),1)*1)","v":{"$error":"#REF!"}},{"$error":"#DIV/0!"},0]
[{"$nulls":8},{"v":0,"d":"0%"},null,{"$error":"#REF!"},"",0,0,0,0,0,0,0,0,0,0,{"$f":"SUM(MID(J110,ROW(INDIRECT(\"h1:H\"&LEN(J110))),1)*1)","v":{"$error":"#REF!"}},{"$error":"#DIV/0!"},0]
[{"$nulls":8},{"v":0,"d":"0%"},null,{"$error":"#REF!"},"",0,0,0,0,0,0,0,0,0,0,{"$f":"SUM(MID(J111,ROW(INDIRECT(\"h1:H\"&LEN(J111))),1)*1)","v":{"$error":"#REF!"}},{"$error":"#DIV/0!"},0]
[{"$nulls":8},{"v":0,"d":"0%"},null,{"$error":"#REF!"},"",0,0,0,0,0,0,0,0,0,0,{"$f":"SUM(MID(J112,ROW(INDIRECT(\"h1:H\"&LEN(J112))),1)*1)","v":{"$error":"#REF!"}},{"$error":"#DIV/0!"},0]
[{"$nulls":8},{"v":0,"d":"0%"},null,{"$error":"#REF!"},"",0,0,0,0,0,0,0,0,0,0,{"$f":"SUM(MID(J113,ROW(INDIRECT(\"h1:H\"&LEN(J113))),1)*1)","v":{"$error":"#REF!"}},{"$error":"#DIV/0!"},0]
[{"$nulls":8},{"v":0,"d":"0%"},null,{"$error":"#REF!"},"",0,0,0,0,0,0,0,0,0,0,{"$f":"SUM(MID(J114,ROW(INDIRECT(\"h1:H\"&LEN(J114))),1)*1)","v":{"$error":"#REF!"}},{"$error":"#DIV/0!"},0]
[{"$nulls":8},{"v":0,"d":"0%"},null,{"$error":"#REF!"},"",0,0,0,0,0,0,0,0,0,0,{"$f":"SUM(MID(J115,ROW(INDIRECT(\"h1:H\"&LEN(J115))),1)*1)","v":{"$error":"#REF!"}},{"$error":"#DIV/0!"},0]
[{"$nulls":8},{"v":0,"d":"0%"},null,{"$error":"#REF!"},"",0,0,0,0,0,0,0,0,0,0,{"$f":"SUM(MID(J116,ROW(INDIRECT(\"h1:H\"&LEN(J116))),1)*1)","v":{"$error":"#REF!"}},{"$error":"#DIV/0!"},0]
[{"$nulls":8},{"v":0,"d":"0%"},null,{"$error":"#REF!"},"",0,0,0,0,0,0,0,0,0,0,{"$f":"SUM(MID(J117,ROW(INDIRECT(\"h1:H\"&LEN(J117))),1)*1)","v":{"$error":"#REF!"}},{"$error":"#DIV/0!"},0]
[{"$nulls":8},{"v":0,"d":"0%"},null,{"$error":"#REF!"},"",0,0,0,0,0,0,0,0,0,0,{"$f":"SUM(MID(J118,ROW(INDIRECT(\"h1:H\"&LEN(J118))),1)*1)","v":{"$error":"#REF!"}},{"$error":"#DIV/0!"},0]
[{"$nulls":8},{"v":0,"d":"0%"},null,{"$error":"#REF!"},"",0,0,0,0,0,0,0,0,0,0,{"$f":"SUM(MID(J119,ROW(INDIRECT(\"h1:H\"&LEN(J119))),1)*1)","v":{"$error":"#REF!"}},{"$error":"#DIV/0!"},0]
[{"$nulls":8},{"v":0,"d":"0%"},null,{"$error":"#REF!"},"",0,0,0,0,0,0,0,0,0,0,{"$f":"SUM(MID(J120,ROW(INDIRECT(\"h1:H\"&LEN(J120))),1)*1)","v":{"$error":"#REF!"}},{"$error":"#DIV/0!"},0]
[{"$nulls":8},{"v":0,"d":"0%"},null,{"$error":"#REF!"},"",0,0,0,0,0,0,0,0,0,0,{"$f":"SUM(MID(J121,ROW(INDIRECT(\"h1:H\"&LEN(J121))),1)*1)","v":{"$error":"#REF!"}},{"$error":"#DIV/0!"},0]
[{"$nulls":8},{"v":0,"d":"0%"},null,{"$error":"#REF!"},"",0,0,0,0,0,0,0,0,0,0,{"$f":"SUM(MID(J122,ROW(INDIRECT(\"h1:H\"&LEN(J122))),1)*1)","v":{"$error":"#REF!"}},{"$error":"#DIV/0!"},0]
[{"$nulls":8},{"v":0,"d":"0%"},null,{"$error":"#REF!"},"",0,0,0,0,0,0,0,0,0,0,{"$f":"SUM(MID(J123,ROW(INDIRECT(\"h1:H\"&LEN(J123))),1)*1)","v":{"$error":"#REF!"}},{"$error":"#DIV/0!"},0]
[{"$nulls":8},{"v":0,"d":"0%"},null,{"$error":"#REF!"},"",0,0,0,0,0,0,0,0,0,0,{"$f":"SUM(MID(J124,ROW(INDIRECT(\"h1:H\"&LEN(J124))),1)*1)","v":{"$error":"#REF!"}},{"$error":"#DIV/0!"},0]
[{"$nulls":8},{"v":0,"d":"0%"},null,{"$error":"#REF!"},"",0,0,0,0,0,0,0,0,0,0,{"$f":"SUM(MID(J125,ROW(INDIRECT(\"h1:H\"&LEN(J125))),1)*1)","v":{"$error":"#REF!"}},{"$error":"#DIV/0!"},0]
[{"$nulls":8},{"v":0,"d":"0%"},null,{"$error":"#REF!"},"",0,0,0,0,0,0,0,0,0,0,{"$f":"SUM(MID(J126,ROW(INDIRECT(\"h1:H\"&LEN(J126))),1)*1)","v":{"$error":"#REF!"}},{"$error":"#DIV/0!"},0]
[{"$nulls":8},{"v":0,"d":"0%"},null,{"$error":"#REF!"},"",0,0,0,0,0,0,0,0,0,0,{"$f":"SUM(MID(J127,ROW(INDIRECT(\"h1:H\"&LEN(J127))),1)*1)","v":{"$error":"#REF!"}},{"$error":"#DIV/0!"},0]
[{"$nulls":8},{"v":0,"d":"0%"},null,{"$error":"#REF!"},"",0,0,{"$f":"M128-LEN(SUBSTITUTE(J128,\"1\",\"\"))+P128","v":0},0,0,0,0,0,0,0,{"$f":"SUM(MID(J128,ROW(INDIRECT(\"h1:H\"&LEN(J128))),1)*1)","v":{"$error":"#REF!"}},{"$error":"#DIV/0!"},0]
[{"$nulls":8},{"v":0,"d":"0%"},null,{"$error":"#REF!"},"",0,0,{"$f":"M129-LEN(SUBSTITUTE(J129,\"1\",\"\"))+P129","v":0},0,0,0,0,0,0,0,{"$f":"SUM(MID(J129,ROW(INDIRECT(\"h1:H\"&LEN(J129))),1)*1)","v":{"$error":"#REF!"}},{"$error":"#DIV/0!"},0]
[{"$nulls":8},{"v":0,"d":"0%"},null,{"$error":"#REF!"},"",0,0,0,0,0,0,0,0,0,0,{"$f":"SUM(MID(J130,ROW(INDIRECT(\"h1:H\"&LEN(J130))),1)*1)","v":{"$error":"#REF!"}},{"$error":"#DIV/0!"},0]
[{"$nulls":8},{"v":0,"d":"0%"},null,{"$error":"#REF!"},"",0,0,0,0,0,0,0,0,0,0,{"$f":"SUM(MID(J131,ROW(INDIRECT(\"h1:H\"&LEN(J131))),1)*1)","v":{"$error":"#REF!"}},{"$error":"#DIV/0!"},0]
[{"$nulls":8},{"v":0,"d":"0%"},null,{"$error":"#REF!"},"",0,0,0,0,0,0,0,0,0,0,{"$f":"SUM(MID(J132,ROW(INDIRECT(\"h1:H\"&LEN(J132))),1)*1)","v":{"$error":"#REF!"}},{"$error":"#DIV/0!"},0]
[{"$nulls":8},{"v":0,"d":"0%"},null,{"$error":"#REF!"},"",0,0,0,0,0,0,0,0,0,0,{"$f":"SUM(MID(J133,ROW(INDIRECT(\"h1:H\"&LEN(J133))),1)*1)","v":{"$error":"#REF!"}},{"$error":"#DIV/0!"},0]
[{"$nulls":8},{"v":0,"d":"0%"},null,{"$error":"#REF!"},"",0,0,0,0,0,0,0,0,0,0,{"$f":"SUM(MID(J134,ROW(INDIRECT(\"h1:H\"&LEN(J134))),1)*1)","v":{"$error":"#REF!"}},{"$error":"#DIV/0!"},0]
[{"$nulls":8},{"v":0,"d":"0%"},null,{"$f":"IF(W135=E135,\"OK\",\"Falsch\")","v":{"$error":"#REF!"}},"",{"$f":"LEN(J135)","v":0},0,0,0,{"$f":"M135-LEN(SUBSTITUTE(J135,\"0\",\"\"))","v":0},{"$f":"I135*M135","v":0},0,{"$f":"M135-(M135-(LEN(J135)-LEN(SUBSTITUTE(J135,\"3\",\"\"))))+M135-(M135-(LEN(J135)-LEN(SUBSTITUTE(J135,\"5\",\"\"))))","v":0},0,{"$f":"M135-(M135-(LEN(J135)-LEN(SUBSTITUTE(J135,\"4\",\"\"))))+M135-(M135-(LEN(J135)-LEN(SUBSTITUTE(J135,\"5\",\"\"))))","v":0},{"$f":"SUM(MID(J135,ROW(INDIRECT(\"h1:H\"&LEN(J135))),1)*1)","v":{"$error":"#REF!"}},{"$error":"#DIV/0!"},0]
[{"$nulls":8},{"v":0,"d":"0%"},null,{"$error":"#REF!"},{"$f":"IF(H136=0,\"\",IF(M136=H136,\"OK\",\"Falsch\"))","v":""},0,{"$f":"M136-(M136-LEN(SUBSTITUTE(J136,\"0\",\"\")))-(M136-LEN(SUBSTITUTE(J136,\"1\",\"\")))-P136","v":0},0,{"$f":"IF($Z$7=\"J\",(M136-LEN(SUBSTITUTE(J136,\"42\",\"\")))/2+(M136-LEN(SUBSTITUTE(J136,\"222\",\"\")))/3,0)","v":0},0,0,{"$f":"ROUND(R136,0)","v":0},0,{"$f":"S136-T136","v":0},0,{"$f":"SUM(MID(J136,ROW(INDIRECT(\"h1:H\"&LEN(J136))),1)*1)","v":{"$error":"#REF!"}},{"$f":"F136/D136","v":{"$error":"#DIV/0!"}},{"$f":"F136-D136","v":0}]
[{"$nulls":8},{"v":0,"d":"0%"},null,{"$error":"#REF!"},"",0,0,0,0,0,0,0,0,0,0,{"$f":"SUM(MID(J137,ROW(INDIRECT(\"h1:H\"&LEN(J137))),1)*1)","v":{"$error":"#REF!"}},{"$error":"#DIV/0!"},0]
[{"$nulls":8},{"v":0,"d":"0%"},null,{"$error":"#REF!"},"",0,0,0,0,0,0,0,0,0,0,{"$f":"SUM(MID(J138,ROW(INDIRECT(\"h1:H\"&LEN(J138))),1)*1)","v":{"$error":"#REF!"}},{"$error":"#DIV/0!"},0]
[{"$nulls":8},{"v":0,"d":"0%"},null,{"$error":"#REF!"},"",0,0,0,0,0,0,0,0,0,0,{"$f":"SUM(MID(J139,ROW(INDIRECT(\"h1:H\"&LEN(J139))),1)*1)","v":{"$error":"#REF!"}},{"$error":"#DIV/0!"},0]
[{"$nulls":8},{"v":0,"d":"0%"},null,{"$error":"#REF!"},"",0,0,0,0,0,0,0,0,0,0,{"$f":"SUM(MID(J140,ROW(INDIRECT(\"h1:H\"&LEN(J140))),1)*1)","v":{"$error":"#REF!"}},{"$error":"#DIV/0!"},0]
[{"$nulls":8},{"v":0,"d":"0%"},null,{"$error":"#REF!"},"",0,0,0,0,0,0,0,0,0,0,{"$f":"SUM(MID(J141,ROW(INDIRECT(\"h1:H\"&LEN(J141))),1)*1)","v":{"$error":"#REF!"}},{"$error":"#DIV/0!"},0]
[{"$nulls":8},{"v":0,"d":"0%"},null,{"$error":"#REF!"},"",0,0,0,0,0,0,0,0,0,0,{"$f":"SUM(MID(J142,ROW(INDIRECT(\"h1:H\"&LEN(J142))),1)*1)","v":{"$error":"#REF!"}},{"$error":"#DIV/0!"},0]
[{"$nulls":8},{"v":0,"d":"0%"},null,{"$error":"#REF!"},"",0,0,0,0,0,0,0,0,0,0,{"$f":"SUM(MID(J143,ROW(INDIRECT(\"h1:H\"&LEN(J143))),1)*1)","v":{"$error":"#REF!"}},{"$error":"#DIV/0!"},0]
[{"$nulls":8},{"v":0,"d":"0%"},null,{"$error":"#REF!"},"",0,0,0,0,0,0,0,0,0,0,{"$f":"SUM(MID(J144,ROW(INDIRECT(\"h1:H\"&LEN(J144))),1)*1)","v":{"$error":"#REF!"}},{"$error":"#DIV/0!"},0]
[{"$nulls":8},{"v":0,"d":"0%"},null,{"$error":"#REF!"},"",0,0,0,0,0,0,0,0,0,0,{"$f":"SUM(MID(J145,ROW(INDIRECT(\"h1:H\"&LEN(J145))),1)*1)","v":{"$error":"#REF!"}},{"$error":"#DIV/0!"},0]
[{"$nulls":8},{"v":0,"d":"0%"},null,{"$error":"#REF!"},"",0,0,0,0,0,0,0,0,0,0,{"$f":"SUM(MID(J146,ROW(INDIRECT(\"h1:H\"&LEN(J146))),1)*1)","v":{"$error":"#REF!"}},{"$error":"#DIV/0!"},0]
[{"$nulls":8},{"v":0,"d":"0%"},null,{"$error":"#REF!"},"",0,0,0,0,0,0,0,0,0,0,{"$f":"SUM(MID(J147,ROW(INDIRECT(\"h1:H\"&LEN(J147))),1)*1)","v":{"$error":"#REF!"}},{"$error":"#DIV/0!"},0]
[{"$nulls":8},{"v":0,"d":"0%"},null,{"$error":"#REF!"},"",0,0,0,0,0,0,0,0,0,0,{"$f":"SUM(MID(J148,ROW(INDIRECT(\"h1:H\"&LEN(J148))),1)*1)","v":{"$error":"#REF!"}},{"$error":"#DIV/0!"},0]
[{"$nulls":8},{"v":0,"d":"0%"},null,{"$error":"#REF!"},"",0,0,0,0,0,0,0,0,0,0,{"$f":"SUM(MID(J149,ROW(INDIRECT(\"h1:H\"&LEN(J149))),1)*1)","v":{"$error":"#REF!"}},{"$error":"#DIV/0!"},0]
[{"$nulls":8},{"v":0,"d":"0%"},null,{"$error":"#REF!"},"",0,0,0,0,0,0,0,0,0,0,{"$f":"SUM(MID(J150,ROW(INDIRECT(\"h1:H\"&LEN(J150))),1)*1)","v":{"$error":"#REF!"}},{"$error":"#DIV/0!"},0]
[{"$nulls":8},{"v":0,"d":"0%"},null,{"$error":"#REF!"},"",0,0,0,0,0,0,0,0,0,0,{"$f":"SUM(MID(J151,ROW(INDIRECT(\"h1:H\"&LEN(J151))),1)*1)","v":{"$error":"#REF!"}},{"$error":"#DIV/0!"},0]
[{"$nulls":8},{"v":0,"d":"0%"},null,{"$error":"#REF!"},"",0,0,0,0,0,0,0,0,0,0,{"$f":"SUM(MID(J152,ROW(INDIRECT(\"h1:H\"&LEN(J152))),1)*1)","v":{"$error":"#REF!"}},{"$error":"#DIV/0!"},0]
[{"$nulls":8},{"v":0,"d":"0%"},null,{"$error":"#REF!"},"",0,0,0,0,0,0,0,0,0,0,{"$f":"SUM(MID(J153,ROW(INDIRECT(\"h1:H\"&LEN(J153))),1)*1)","v":{"$error":"#REF!"}},{"$error":"#DIV/0!"},0]
[{"$nulls":8},{"v":0,"d":"0%"},null,{"$error":"#REF!"},"",0,0,0,0,0,0,0,0,0,0,{"$f":"SUM(MID(J154,ROW(INDIRECT(\"h1:H\"&LEN(J154))),1)*1)","v":{"$error":"#REF!"}},{"$error":"#DIV/0!"},0]
[{"$nulls":8},{"v":0,"d":"0%"},null,{"$error":"#REF!"},"",0,0,0,0,0,0,0,0,0,0,{"$f":"SUM(MID(J155,ROW(INDIRECT(\"h1:H\"&LEN(J155))),1)*1)","v":{"$error":"#REF!"}},{"$error":"#DIV/0!"},0]
[{"$nulls":8},{"v":0,"d":"0%"},null,{"$error":"#REF!"},"",0,0,0,0,0,0,0,0,0,0,{"$f":"SUM(MID(J156,ROW(INDIRECT(\"h1:H\"&LEN(J156))),1)*1)","v":{"$error":"#REF!"}},{"$error":"#DIV/0!"},0]
[{"$nulls":8},{"v":0,"d":"0%"},null,{"$error":"#REF!"},"",0,0,0,0,0,0,0,0,0,0,{"$f":"SUM(MID(J157,ROW(INDIRECT(\"h1:H\"&LEN(J157))),1)*1)","v":{"$error":"#REF!"}},{"$error":"#DIV/0!"},0]
[{"$nulls":8},{"v":0,"d":"0%"},null,{"$error":"#REF!"},"",0,0,0,0,0,0,0,0,0,0,{"$f":"SUM(MID(J158,ROW(INDIRECT(\"h1:H\"&LEN(J158))),1)*1)","v":{"$error":"#REF!"}},{"$error":"#DIV/0!"},0]
[{"$nulls":8},{"v":0,"d":"0%"},null,{"$error":"#REF!"},"",0,0,0,0,0,0,0,0,0,0,{"$f":"SUM(MID(J159,ROW(INDIRECT(\"h1:H\"&LEN(J159))),1)*1)","v":{"$error":"#REF!"}},{"$error":"#DIV/0!"},0]
[{"$nulls":8},{"v":0,"d":"0%"},null,{"$error":"#REF!"},"",0,0,0,0,0,0,0,0,0,0,{"$f":"SUM(MID(J160,ROW(INDIRECT(\"h1:H\"&LEN(J160))),1)*1)","v":{"$error":"#REF!"}},{"$error":"#DIV/0!"},0]
[{"$nulls":8},{"v":0,"d":"0%"},null,{"$error":"#REF!"},"",0,0,0,0,0,0,0,0,0,0,{"$f":"SUM(MID(J161,ROW(INDIRECT(\"h1:H\"&LEN(J161))),1)*1)","v":{"$error":"#REF!"}},{"$error":"#DIV/0!"},0]
[{"$nulls":8},{"v":0,"d":"0%"},null,{"$error":"#REF!"},"",0,0,0,0,0,0,0,0,0,0,{"$f":"SUM(MID(J162,ROW(INDIRECT(\"h1:H\"&LEN(J162))),1)*1)","v":{"$error":"#REF!"}},{"$error":"#DIV/0!"},0]
[{"$nulls":8},{"v":0,"d":"0%"},null,{"$error":"#REF!"},"",0,0,0,0,0,0,0,0,0,0,{"$f":"SUM(MID(J163,ROW(INDIRECT(\"h1:H\"&LEN(J163))),1)*1)","v":{"$error":"#REF!"}},{"$error":"#DIV/0!"},0]
[158,"",{"$nulls":6},{"v":0,"d":"0%"},null,{"$error":"#REF!"},"",0,0,0,0,0,0,0,0,0,0,{"$f":"SUM(MID(J164,ROW(INDIRECT(\"h1:H\"&LEN(J164))),1)*1)","v":{"$error":"#REF!"}},{"$error":"#DIV/0!"},0]
[159,"",{"$nulls":6},{"v":0,"d":"0%"},null,{"$error":"#REF!"},"",0,0,0,0,0,0,0,0,0,0,{"$f":"SUM(MID(J165,ROW(INDIRECT(\"h1:H\"&LEN(J165))),1)*1)","v":{"$error":"#REF!"}},{"$error":"#DIV/0!"},0]
[160,"",{"$nulls":6},{"v":0,"d":"0%"},null,{"$error":"#REF!"},"",0,0,0,0,0,0,0,0,0,0,{"$f":"SUM(MID(J166,ROW(INDIRECT(\"h1:H\"&LEN(J166))),1)*1)","v":{"$error":"#REF!"}},{"$error":"#DIV/0!"},0]
[161,"",{"$nulls":6},{"v":0,"d":"0%"},null,{"$error":"#REF!"},"",0,0,0,0,0,0,0,0,0,0,{"$f":"SUM(MID(J167,ROW(INDIRECT(\"h1:H\"&LEN(J167))),1)*1)","v":{"$error":"#REF!"}},{"$error":"#DIV/0!"},0]
[162,"",{"$nulls":6},{"v":0,"d":"0%"},null,{"$error":"#REF!"},"",0,0,0,0,0,0,0,0,0,0,{"$f":"SUM(MID(J168,ROW(INDIRECT(\"h1:H\"&LEN(J168))),1)*1)","v":{"$error":"#REF!"}},{"$error":"#DIV/0!"},0]
[163,"",{"$nulls":6},{"v":0,"d":"0%"},null,{"$error":"#REF!"},"",0,0,0,0,0,0,0,0,0,0,{"$f":"SUM(MID(J169,ROW(INDIRECT(\"h1:H\"&LEN(J169))),1)*1)","v":{"$error":"#REF!"}},{"$error":"#DIV/0!"},0]
[164,"",{"$nulls":6},{"v":0,"d":"0%"},null,{"$error":"#REF!"},"",0,0,0,0,0,0,0,0,0,0,{"$f":"SUM(MID(J170,ROW(INDIRECT(\"h1:H\"&LEN(J170))),1)*1)","v":{"$error":"#REF!"}},{"$error":"#DIV/0!"},0]
[165,"",{"$nulls":6},{"v":0,"d":"0%"},null,{"$error":"#REF!"},"",0,0,0,0,0,0,0,0,0,0,{"$f":"SUM(MID(J171,ROW(INDIRECT(\"h1:H\"&LEN(J171))),1)*1)","v":{"$error":"#REF!"}},{"$error":"#DIV/0!"},0]
[166,"",{"$nulls":6},{"v":0,"d":"0%"},null,{"$error":"#REF!"},"",0,0,0,0,0,0,0,0,0,0,{"$f":"SUM(MID(J172,ROW(INDIRECT(\"h1:H\"&LEN(J172))),1)*1)","v":{"$error":"#REF!"}},{"$error":"#DIV/0!"},0]
[167,"",{"$nulls":6},{"v":0,"d":"0%"},null,{"$error":"#REF!"},"",0,0,0,0,0,0,0,0,0,0,{"$f":"SUM(MID(J173,ROW(INDIRECT(\"h1:H\"&LEN(J173))),1)*1)","v":{"$error":"#REF!"}},{"$error":"#DIV/0!"},0]
[168,"",{"$nulls":6},{"v":0,"d":"0%"},null,{"$error":"#REF!"},"",0,0,0,0,0,0,0,0,0,0,{"$f":"SUM(MID(J174,ROW(INDIRECT(\"h1:H\"&LEN(J174))),1)*1)","v":{"$error":"#REF!"}},{"$error":"#DIV/0!"},0]
[169,"",{"$nulls":6},{"v":0,"d":"0%"},null,{"$error":"#REF!"},"",0,0,0,0,0,0,0,0,0,0,{"$f":"SUM(MID(J175,ROW(INDIRECT(\"h1:H\"&LEN(J175))),1)*1)","v":{"$error":"#REF!"}},{"$error":"#DIV/0!"},0]
[170,"",{"$nulls":6},{"v":0,"d":"0%"},null,{"$error":"#REF!"},"",0,0,0,0,0,0,0,0,0,0,{"$f":"SUM(MID(J176,ROW(INDIRECT(\"h1:H\"&LEN(J176))),1)*1)","v":{"$error":"#REF!"}},{"$error":"#DIV/0!"},0]
[171,"",{"$nulls":6},{"v":0,"d":"0%"},null,{"$error":"#REF!"},"",0,0,0,0,0,0,0,0,0,0,{"$f":"SUM(MID(J177,ROW(INDIRECT(\"h1:H\"&LEN(J177))),1)*1)","v":{"$error":"#REF!"}},{"$error":"#DIV/0!"},0]
[172,"",{"$nulls":6},{"v":0,"d":"0%"},null,{"$error":"#REF!"},"",0,0,0,0,0,0,0,0,0,0,{"$f":"SUM(MID(J178,ROW(INDIRECT(\"h1:H\"&LEN(J178))),1)*1)","v":{"$error":"#REF!"}},{"$error":"#DIV/0!"},0]
[173,"",{"$nulls":6},{"v":0,"d":"0%"},null,{"$error":"#REF!"},"",0,0,0,0,0,0,0,0,0,0,{"$f":"SUM(MID(J179,ROW(INDIRECT(\"h1:H\"&LEN(J179))),1)*1)","v":{"$error":"#REF!"}},{"$error":"#DIV/0!"},0]
[174,"",{"$nulls":6},{"v":0,"d":"0%"},null,{"$error":"#REF!"},"",0,0,0,0,0,0,0,0,0,0,{"$f":"SUM(MID(J180,ROW(INDIRECT(\"h1:H\"&LEN(J180))),1)*1)","v":{"$error":"#REF!"}},{"$error":"#DIV/0!"},0]
[175,"",{"$nulls":6},{"v":0,"d":"0%"},null,{"$error":"#REF!"},"",0,0,0,0,0,0,0,0,0,0,{"$f":"SUM(MID(J181,ROW(INDIRECT(\"h1:H\"&LEN(J181))),1)*1)","v":{"$error":"#REF!"}},{"$error":"#DIV/0!"},0]
[176,{"$nulls":7},{"v":0,"d":"0%"},null,{"$error":"#REF!"},"",0,0,0,0,0,0,0,0,0,0,{"$f":"SUM(MID(J182,ROW(INDIRECT(\"h1:H\"&LEN(J182))),1)*1)","v":{"$error":"#REF!"}},{"$error":"#DIV/0!"},0]
[177,{"$nulls":7},{"v":0,"d":"0%"},null,{"$error":"#REF!"},"",0,0,0,0,0,0,0,0,0,0,{"$f":"SUM(MID(J183,ROW(INDIRECT(\"h1:H\"&LEN(J183))),1)*1)","v":{"$error":"#REF!"}},{"$error":"#DIV/0!"},0]
[178,{"$nulls":7},{"v":0,"d":"0%"},null,{"$error":"#REF!"},"",0,0,0,0,0,0,0,0,0,0,{"$f":"SUM(MID(J184,ROW(INDIRECT(\"h1:H\"&LEN(J184))),1)*1)","v":{"$error":"#REF!"}},{"$error":"#DIV/0!"},0]
[179,{"$nulls":7},{"v":0,"d":"0%"},null,{"$error":"#REF!"},"",0,0,0,0,0,0,0,0,0,0,{"$f":"SUM(MID(J185,ROW(INDIRECT(\"h1:H\"&LEN(J185))),1)*1)","v":{"$error":"#REF!"}},{"$error":"#DIV/0!"},0]
[180,{"$nulls":7},{"v":0,"d":"0%"},null,{"$error":"#REF!"},"",0,0,0,0,0,0,0,0,0,0,{"$f":"SUM(MID(J186,ROW(INDIRECT(\"h1:H\"&LEN(J186))),1)*1)","v":{"$error":"#REF!"}},{"$error":"#DIV/0!"},0]
[181,{"$nulls":7},{"v":0,"d":"0%"},null,{"$error":"#REF!"},"",0,0,0,0,0,0,0,0,0,0,{"$f":"SUM(MID(J187,ROW(INDIRECT(\"h1:H\"&LEN(J187))),1)*1)","v":{"$error":"#REF!"}},{"$error":"#DIV/0!"},0]
[182,{"$nulls":7},{"v":0,"d":"0%"},null,{"$error":"#REF!"},"",0,0,0,0,0,0,0,0,0,0,{"$f":"SUM(MID(J188,ROW(INDIRECT(\"h1:H\"&LEN(J188))),1)*1)","v":{"$error":"#REF!"}},{"$error":"#DIV/0!"},0]
[183,{"$nulls":7},{"v":0,"d":"0%"},null,{"$error":"#REF!"},"",0,0,0,0,0,0,0,0,0,0,{"$f":"SUM(MID(J189,ROW(INDIRECT(\"h1:H\"&LEN(J189))),1)*1)","v":{"$error":"#REF!"}},{"$error":"#DIV/0!"},0]
[184,{"$nulls":7},{"v":0,"d":"0%"},null,{"$error":"#REF!"},"",0,0,0,0,0,0,0,0,0,0,{"$f":"SUM(MID(J190,ROW(INDIRECT(\"h1:H\"&LEN(J190))),1)*1)","v":{"$error":"#REF!"}},{"$error":"#DIV/0!"},0]
[185,{"$nulls":7},{"v":0,"d":"0%"},null,{"$error":"#REF!"},"",0,0,0,0,0,0,0,0,0,0,{"$f":"SUM(MID(J191,ROW(INDIRECT(\"h1:H\"&LEN(J191))),1)*1)","v":{"$error":"#REF!"}},{"$error":"#DIV/0!"},0]
[186,{"$nulls":7},{"v":0,"d":"0%"},null,{"$error":"#REF!"},"",0,0,0,0,0,0,0,0,0,0,{"$f":"SUM(MID(J192,ROW(INDIRECT(\"h1:H\"&LEN(J192))),1)*1)","v":{"$error":"#REF!"}},{"$error":"#DIV/0!"},0]
[187,{"$nulls":7},{"v":0,"d":"0%"},null,{"$error":"#REF!"},"",0,0,{"$f":"M193-LEN(SUBSTITUTE(J193,\"1\",\"\"))+P193","v":0},0,0,0,0,0,0,0,{"$f":"SUM(MID(J193,ROW(INDIRECT(\"h1:H\"&LEN(J193))),1)*1)","v":{"$error":"#REF!"}},{"$error":"#DIV/0!"},0]
[188,{"$nulls":7},{"v":0,"d":"0%"},null,{"$error":"#REF!"},"",0,0,0,0,0,0,0,0,0,0,{"$f":"SUM(MID(J194,ROW(INDIRECT(\"h1:H\"&LEN(J194))),1)*1)","v":{"$error":"#REF!"}},{"$error":"#DIV/0!"},0]
[189,{"$nulls":7},{"v":0,"d":"0%"},null,{"$error":"#REF!"},"",0,0,0,0,0,0,0,0,0,0,{"$f":"SUM(MID(J195,ROW(INDIRECT(\"h1:H\"&LEN(J195))),1)*1)","v":{"$error":"#REF!"}},{"$error":"#DIV/0!"},0]
[190,{"$nulls":7},{"v":0,"d":"0%"},null,{"$error":"#REF!"},"",0,0,0,0,0,0,0,0,0,0,{"$f":"SUM(MID(J196,ROW(INDIRECT(\"h1:H\"&LEN(J196))),1)*1)","v":{"$error":"#REF!"}},{"$error":"#DIV/0!"},0]
[191,{"$nulls":7},{"v":0,"d":"0%"},null,{"$error":"#REF!"},"",0,0,0,0,0,0,0,0,0,0,{"$f":"SUM(MID(J197,ROW(INDIRECT(\"h1:H\"&LEN(J197))),1)*1)","v":{"$error":"#REF!"}},{"$error":"#DIV/0!"},0]
[192,{"$nulls":7},{"v":0,"d":"0%"},null,{"$error":"#REF!"},"",0,0,0,0,0,0,0,0,0,0,{"$f":"SUM(MID(J198,ROW(INDIRECT(\"h1:H\"&LEN(J198))),1)*1)","v":{"$error":"#REF!"}},{"$error":"#DIV/0!"},0]
[193,{"$nulls":7},{"v":0,"d":"0%"},null,{"$f":"IF(W199=E199,\"OK\",\"Falsch\")","v":{"$error":"#REF!"}},"",{"$f":"LEN(J199)","v":0},0,0,0,{"$f":"M199-LEN(SUBSTITUTE(J199,\"0\",\"\"))","v":0},{"$f":"I199*M199","v":0},0,{"$f":"M199-(M199-(LEN(J199)-LEN(SUBSTITUTE(J199,\"3\",\"\"))))+M199-(M199-(LEN(J199)-LEN(SUBSTITUTE(J199,\"5\",\"\"))))","v":0},0,{"$f":"M199-(M199-(LEN(J199)-LEN(SUBSTITUTE(J199,\"4\",\"\"))))+M199-(M199-(LEN(J199)-LEN(SUBSTITUTE(J199,\"5\",\"\"))))","v":0},{"$f":"SUM(MID(J199,ROW(INDIRECT(\"h1:H\"&LEN(J199))),1)*1)","v":{"$error":"#REF!"}},{"$error":"#DIV/0!"},0]
[194,{"$nulls":7},{"v":0,"d":"0%"},null,{"$error":"#REF!"},{"$f":"IF(H200=0,\"\",IF(M200=H200,\"OK\",\"Falsch\"))","v":""},0,{"$f":"M200-(M200-LEN(SUBSTITUTE(J200,\"0\",\"\")))-(M200-LEN(SUBSTITUTE(J200,\"1\",\"\")))-P200","v":0},0,{"$f":"IF($Z$7=\"J\",(M200-LEN(SUBSTITUTE(J200,\"42\",\"\")))/2+(M200-LEN(SUBSTITUTE(J200,\"222\",\"\")))/3,0)","v":0},0,0,{"$f":"ROUND(R200,0)","v":0},0,{"$f":"S200-T200","v":0},0,{"$f":"SUM(MID(J200,ROW(INDIRECT(\"h1:H\"&LEN(J200))),1)*1)","v":{"$error":"#REF!"}},{"$f":"F200/D200","v":{"$error":"#DIV/0!"}},{"$f":"F200-D200","v":0}]
[195,{"$nulls":7},{"v":0,"d":"0%"},null,{"$error":"#REF!"},"",0,0,0,0,0,0,0,0,0,0,{"$f":"SUM(MID(J201,ROW(INDIRECT(\"h1:H\"&LEN(J201))),1)*1)","v":{"$error":"#REF!"}},{"$error":"#DIV/0!"},0]
[196,{"$nulls":7},{"v":0,"d":"0%"},null,{"$error":"#REF!"},"",0,0,0,0,0,0,0,0,0,0,{"$f":"SUM(MID(J202,ROW(INDIRECT(\"h1:H\"&LEN(J202))),1)*1)","v":{"$error":"#REF!"}},{"$error":"#DIV/0!"},0]
[197,{"$nulls":7},{"v":0,"d":"0%"},null,{"$error":"#REF!"},"",0,0,0,0,0,0,0,0,0,0,{"$f":"SUM(MID(J203,ROW(INDIRECT(\"h1:H\"&LEN(J203))),1)*1)","v":{"$error":"#REF!"}},{"$error":"#DIV/0!"},0]
[198,{"$nulls":7},{"v":0,"d":"0%"},null,{"$error":"#REF!"},"",0,0,0,0,0,0,0,0,0,0,{"$f":"SUM(MID(J204,ROW(INDIRECT(\"h1:H\"&LEN(J204))),1)*1)","v":{"$error":"#REF!"}},{"$error":"#DIV/0!"},0]
[199,{"$nulls":7},{"v":0,"d":"0%"},null,{"$error":"#REF!"},"",0,0,0,0,0,0,0,0,0,0,{"$f":"SUM(MID(J205,ROW(INDIRECT(\"h1:H\"&LEN(J205))),1)*1)","v":{"$error":"#REF!"}},{"$error":"#DIV/0!"},0]
[200,{"$nulls":7},{"v":0,"d":"0%"},null,{"$error":"#REF!"},"",0,0,0,0,0,0,0,0,0,0,{"$f":"SUM(MID(J206,ROW(INDIRECT(\"h1:H\"&LEN(J206))),1)*1)","v":{"$error":"#REF!"}},{"$error":"#DIV/0!"},0]

{"sheet":"2022-11-29-STB-L3","index":1,"n_rows":206,"n_cols":26,"rows_kept":206}
["Turnier:",null,"https://lichess.org/tournament/MR0ue7kV"]
["Datum:",null,"2022-11-29"]
["Bed.Zeit:",null,"5/3"]
["Berserker:",null,"J","(J/N)"]
["Arenastr:",null,"N","(J/N)"]
["Rang","Titel","Benutzername","Elo","Pkt.","Perf.","Team","Anzahl\nPartien","Bers.\n%","Partien Resultate","Check\nPunkte","Check\nAnzahl\nPartien","Part.","Win","Remis","Arena\nRemis","Lose","Total Berserker","Tot.\nBers.","Bers.\nWin","Bers.\nRemis\n Lose","Arena\nStrikes","Pkt.","Faktor\nPerformance\ngeteilt durch\nElozahl","Elo Zuwachs\nPerformance\nminus Elozahl"]
[1,"","OrcaTec",2376,31,2456,"sc-wettswil",13,{"v":0.54,"d":"54%"},"1323333322231",{"$f":"IF(W7=E7,\"OK\",\"Falsch\")","v":"OK"},{"$f":"IF(H7=0,\"\",IF(M7=H7,\"OK\",\"Falsch\"))","v":"OK"},{"$f":"LEN(J7)","v":13},{"$f":"M7-(M7-LEN(SUBSTITUTE(J7,\"0\",\"\")))-(M7-LEN(SUBSTITUTE(J7,\"1\",\"\")))-P7","v":11},{"$f":"M7-LEN(SUBSTITUTE(J7,\"1\",\"\"))+P7","v":2},{"$f":"IF($Z$7=\"J\",(M7-LEN(SUBSTITUTE(J7,\"42\",\"\")))/2+(M7-LEN(SUBSTITUTE(J7,\"222\",\"\")))/3,0)","v":0},{"$f":"M7-LEN(SUBSTITUTE(J7,\"0\",\"\"))","v":0},{"$f":"I7*M7","v":{"v":7.0200000000000005,"d":"7"}},{"$f":"ROUND(R7,0)","v":7},{"$f":"M7-(M7-(LEN(J7)-LEN(SUBSTITUTE(J7,\"3\",\"\"))))+M7-(M7-(LEN(J7)-LEN(SUBSTITUTE(J7,\"5\",\"\"))))","v":7},{"$f":"S7-T7","v":0},{"$f":"M7-(M7-(LEN(J7)-LEN(SUBSTITUTE(J7,\"4\",\"\"))))+M7-(M7-(LEN(J7)-LEN(SUBSTITUTE(J7,\"5\",\"\"))))","v":0},{"$f":"SUM(MID(J7,ROW(INDIRECT(\"h1:H\"&LEN(J7))),1)*1)","v":31},{"$f":"F7/D7","v":{"v":1.0336700336700337,"d":"1.03"}},{"$f":"F7-D7","v":80},{"$f":"C5","v":"N"}]
[2,"","Mauritiusb4",2358,15,2362,"schachgesellschaft-riehen",9,{"v":0,"d":"0%"},"122212221","OK",{"$f":"IF(H8=0,\"\",IF(M8=H8,\"OK\",\"Falsch\"))","v":"OK"},9,{"$f":"M8-(M8-LEN(SUBSTITUTE(J8,\"0\",\"\")))-(M8-LEN(SUBSTITUTE(J8,\"1\",\"\")))-P8","v":6},3,{"$f":"IF($Z$7=\"J\",(M8-LEN(SUBSTITUTE(J8,\"42\",\"\")))/2+(M8-LEN(SUBSTITUTE(J8,\"222\",\"\")))/3,0)","v":0},0,0,{"$f":"ROUND(R8,0)","v":0},0,{"$f":"S8-T8","v":0},0,{"$f":"SUM(MID(J8,ROW(INDIRECT(\"h1:H\"&LEN(J8))),1)*1)","v":15},{"$f":"F8/D8","v":{"v":1.001696352841391,"d":"1.00"}},{"$f":"F8-D8","v":4}]
[3,"","jfkfffj",1991,14,2060,"sprengschach-konig",11,{"v":0,"d":"0%"},"20220222020","OK","OK",11,7,0,0,4,0,0,0,0,0,{"$f":"SUM(MID(J9,ROW(INDIRECT(\"h1:H\"&LEN(J9))),1)*1)","v":14},{"v":1.0346559517830236,"d":"1.03"},69]
[4,"","Plattmacher2000",2087,13,2124,"schachgesellschaft-riehen",9,{"v":0,"d":"0%"},"120202222","OK","OK",9,6,1,0,2,0,0,0,0,0,{"$f":"SUM(MID(J10,ROW(INDIRECT(\"h1:H\"&LEN(J10))),1)*1)","v":13},{"v":1.0177287973167226,"d":"1.02"},37]
[5,"","Jacks2268",2228,12,2075,"vevey",9,{"v":0.33,"d":"33%"},"203213001","OK","OK",9,4,2,0,3,{"v":2.97,"d":"3"},3,2,1,0,{"$f":"SUM(MID(J11,ROW(INDIRECT(\"h1:H\"&LEN(J11))),1)*1)","v":12},{"v":0.9313285457809695,"d":"0.93"},{"v":-153,"d":"-153 "}]
[6,"","drohde",1762,12,1980,"sc-therwil",10,{"v":0,"d":"0%"},"2002022220","OK","OK",10,6,0,0,4,0,0,0,0,0,{"$f":"SUM(MID(J12,ROW(INDIRECT(\"h1:H\"&LEN(J12))),1)*1)","v":12},{"v":1.1237230419977298,"d":"1.12"},218]
[7,"","berb",1910,12,1895,"sc-therwil",10,{"v":0.1,"d":"10%"},"1020002322","OK","OK",10,5,1,0,4,1,1,1,0,0,{"$f":"SUM(MID(J13,ROW(INDIRECT(\"h1:H\"&LEN(J13))),1)*1)","v":12},{"v":0.9921465968586387,"d":"0.99"},{"v":-15,"d":"-15 "}]
[8,"","wind_mind",2179,12,1890,"schachgesellschaft-winterthur",10,{"v":0.6,"d":"60%"},"0302033001","OK","OK",10,4,1,0,5,6,6,3,3,0,{"$f":"SUM(MID(J14,ROW(INDIRECT(\"h1:H\"&LEN(J14))),1)*1)","v":12},{"v":0.867370353373107,"d":"0.87"},{"v":-289,"d":"-289 "}]
[9,"","Maeximum",1823,11,2181,"sprengschach-konig",8,{"v":0,"d":"0%"},"22220021","OK","OK",8,5,1,0,2,0,0,0,0,0,{"$f":"SUM(MID(J15,ROW(INDIRECT(\"h1:H\"&LEN(J15))),1)*1)","v":11},{"v":1.1963795940756994,"d":"1.20"},358]
[10,"","OlafNazarenus",2074,11,2006,"sprengschach-konig",9,{"v":0,"d":"0%"},"120200222","OK","OK",9,5,1,0,3,0,0,0,0,0,{"$f":"SUM(MID(J16,ROW(INDIRECT(\"h1:H\"&LEN(J16))),1)*1)","v":11},{"v":0.9672131147540983,"d":"0.97"},{"v":-68,"d":"-68 "}]
[11,"","ACAJ",1820,11,1698,"sorab-basel-2",11,{"v":0,"d":"0%"},"20020202021","OK","OK",11,5,1,0,5,0,0,0,0,0,{"$f":"SUM(MID(J17,ROW(INDIRECT(\"h1:H\"&LEN(J17))),1)*1)","v":11},{"v":0.932967032967033,"d":"0.93"},{"v":-122,"d":"-122 "}]
[12,"","Namaste93",2403,10,2159,"schachgesellschaft-winterthur",5,{"v":0.2,"d":"20%"},"12232","OK","OK",5,4,1,0,0,1,1,1,0,0,{"$f":"SUM(MID(J18,ROW(INDIRECT(\"h1:H\"&LEN(J18))),1)*1)","v":10},{"v":0.8984602580108199,"d":"0.90"},{"v":-244,"d":"-244 "}]
[13,"","Corvatsch",2084,10,1921,"schachgesellschaft-winterthur",6,{"v":0.67,"d":"67%"},"310330","OK","OK",6,3,1,0,2,{"v":4.0200000000000005,"d":"4"},4,3,1,0,{"$f":"SUM(MID(J19,ROW(INDIRECT(\"h1:H\"&LEN(J19))),1)*1)","v":10},{"v":0.9217850287907869,"d":"0.92"},{"v":-163,"d":"-163 "}]
[14,"","ThiraNoe",1899,10,1915,"la-dame-blanche",7,{"v":0.29,"d":"29%"},"2230300","OK","OK",7,4,0,0,3,{"v":2.03,"d":"2"},2,2,0,0,{"$f":"SUM(MID(J20,ROW(INDIRECT(\"h1:H\"&LEN(J20))),1)*1)","v":10},{"v":1.0084254870984728,"d":"1.01"},16]
[15,"","Parzival1912",2156,10,1829,"schachgesellschaft-winterthur",5,{"v":0.8,"d":"80%"},"33013","OK","OK",5,3,1,0,1,4,4,3,1,0,{"$f":"SUM(MID(J21,ROW(INDIRECT(\"h1:H\"&LEN(J21))),1)*1)","v":10},{"v":0.8483302411873841,"d":"0.85"},{"v":-327,"d":"-327 "}]
[16,"","viktor_chesser",1823,10,1814,"unibe-chess-club",8,{"v":0.38,"d":"38%"},"00322030","OK","OK",8,4,0,0,4,{"v":3.04,"d":"3"},3,2,1,0,{"$f":"SUM(MID(J22,ROW(INDIRECT(\"h1:H\"&LEN(J22))),1)*1)","v":10},{"v":0.9950630828304992,"d":"1.00"},{"v":-9,"d":"-9 "}]
[17,"","ChessShah",1953,9,1982,"sprengschach-konig",7,{"v":0,"d":"0%"},"0021222","OK","OK",7,4,1,0,2,0,0,0,0,0,{"$f":"SUM(MID(J23,ROW(INDIRECT(\"h1:H\"&LEN(J23))),1)*1)","v":9},{"v":1.0148489503328213,"d":"1.01"},29]
[18,"","Stampfer",1935,8,1847,"sc-dubendorf",9,{"v":0,"d":"0%"},"102102020","OK","OK",9,3,2,0,4,0,0,0,0,0,{"$f":"SUM(MID(J24,ROW(INDIRECT(\"h1:H\"&LEN(J24))),1)*1)","v":8},{"v":0.9545219638242894,"d":"0.95"},{"v":-88,"d":"-88 "}]
[19,"","Hsobolew",1606,8,1836,"sorab-basel-2",7,{"v":0,"d":"0%"},"2220002","OK","OK",7,4,0,0,3,0,0,0,0,0,{"$f":"SUM(MID(J25,ROW(INDIRECT(\"h1:H\"&LEN(J25))),1)*1)","v":8},{"v":1.1432129514321294,"d":"1.14"},230]
[20,"","milostiva",1857,7,2032,"sorab-basel-2",6,{"v":0,"d":"0%"},"220201","OK","OK",6,3,1,0,2,0,0,0,0,0,{"$f":"SUM(MID(J26,ROW(INDIRECT(\"h1:H\"&LEN(J26))),1)*1)","v":7},{"v":1.0942380183091007,"d":"1.09"},175]
[21,"","Riskanter",1829,7,1891,"schachclub-ubs-zurich",6,{"v":0,"d":"0%"},"222100","OK","OK",6,3,1,0,2,0,0,0,0,0,{"$f":"SUM(MID(J27,ROW(INDIRECT(\"h1:H\"&LEN(J27))),1)*1)","v":7},{"v":1.0338983050847457,"d":"1.03"},62]
[22,"WIM","ChessDonkey",2380,6,2445,"schachgesellschaft-riehen",3,{"v":0,"d":"0%"},"222","OK","OK",3,3,0,0,0,0,0,0,0,0,{"$f":"SUM(MID(J28,ROW(INDIRECT(\"h1:H\"&LEN(J28))),1)*1)","v":6},{"v":1.0273109243697478,"d":"1.03"},65]
[23,"IM","ChessHobbits99",2741,6,2057,"schachgesellschaft-riehen",3,{"v":1,"d":"100%"},"330","OK","OK",3,2,0,0,1,3,3,2,1,0,{"$f":"SUM(MID(J29,ROW(INDIRECT(\"h1:H\"&LEN(J29))),1)*1)","v":6},{"v":0.7504560379423568,"d":"0.75"},{"v":-684,"d":"-684 "}]
[24,"","beatri1a",1584,6,1890,"sk-zollikofen-2",8,{"v":0,"d":"0%"},"22200000","OK","OK",8,3,0,0,5,0,0,0,0,0,{"$f":"SUM(MID(J30,ROW(INDIRECT(\"h1:H\"&LEN(J30))),1)*1)","v":6},{"v":1.1931818181818181,"d":"1.19"},306]
[25,"","Lord_Wimbooo",1839,6,1829,"unibe-chess-club",9,{"v":0,"d":"0%"},"000222000","OK","OK",9,3,0,0,6,0,0,0,0,0,{"$f":"SUM(MID(J31,ROW(INDIRECT(\"h1:H\"&LEN(J31))),1)*1)","v":6},{"v":0.9945622620989668,"d":"0.99"},{"v":-10,"d":"-10 "}]
[26,"","WalterFrehner",1872,6,1817,"schachclub-ubs-zurich",4,{"v":0,"d":"0%"},"2022","OK","OK",4,3,0,0,1,0,0,0,0,0,{"$f":"SUM(MID(J32,ROW(INDIRECT(\"h1:H\"&LEN(J32))),1)*1)","v":6},{"v":0.9706196581196581,"d":"0.97"},{"v":-55,"d":"-55 "}]
[27,"","Rade-Sorab",1746,6,1629,"sorab-basel-2",5,{"v":0,"d":"0%"},"00222","OK","OK",5,3,0,0,2,0,0,0,0,0,{"$f":"SUM(MID(J33,ROW(INDIRECT(\"h1:H\"&LEN(J33))),1)*1)","v":6},{"v":0.9329896907216495,"d":"0.93"},{"v":-117,"d":"-117 "}]
[28,"","Kellerga",1333,6,1568,"sk-zollikofen-2",8,{"v":0,"d":"0%"},"20200002","OK","OK",8,3,0,0,5,0,0,0,0,0,{"$f":"SUM(MID(J34,ROW(INDIRECT(\"h1:H\"&LEN(J34))),1)*1)","v":6},{"v":1.1762940735183796,"d":"1.18"},235]
[29,"","albrechtz",1307,6,1534,"sk-zollikofen-2",11,{"v":0,"d":"0%"},"02020000002","OK","OK",11,3,0,0,8,0,0,0,0,0,{"$f":"SUM(MID(J35,ROW(INDIRECT(\"h1:H\"&LEN(J35))),1)*1)","v":6},{"v":1.173680183626626,"d":"1.17"},227]
[30,"","Ben1ch0n",1496,6,1472,"vevey",8,{"v":0,"d":"0%"},"22000200","OK","OK",8,3,0,0,5,0,0,0,0,0,{"$f":"SUM(MID(J36,ROW(INDIRECT(\"h1:H\"&LEN(J36))),1)*1)","v":6},{"v":0.983957219251337,"d":"0.98"},{"v":-24,"d":"-24 "}]
[31,"","ta29",1751,6,1464,"schachgesellschaft-riehen",11,{"v":0,"d":"0%"},"02000020200","OK","OK",11,3,0,0,8,0,0,0,0,0,{"$f":"SUM(MID(J37,ROW(INDIRECT(\"h1:H\"&LEN(J37))),1)*1)","v":6},{"v":0.836093660765277,"d":"0.84"},{"v":-287,"d":"-287 "}]
[32,"","Steiger2",2055,4,2237,"schachgesellschaft-riehen",2,{"v":0,"d":"0%"},"22","OK","OK",2,2,0,0,0,0,0,0,0,0,{"$f":"SUM(MID(J38,ROW(INDIRECT(\"h1:H\"&LEN(J38))),1)*1)","v":4},{"v":1.0885644768856448,"d":"1.09"},182]
[33,"","chrisg99",1929,4,1962,"unibe-chess-club",3,{"v":0,"d":"0%"},"220","OK","OK",3,2,0,0,1,0,0,0,0,0,{"$f":"SUM(MID(J39,ROW(INDIRECT(\"h1:H\"&LEN(J39))),1)*1)","v":4},{"v":1.0171073094867806,"d":"1.02"},33]
[34,"","tabaluga42",1847,4,1919,"sk-zollikofen-2",4,{"v":0,"d":"0%"},"0220","OK","OK",4,2,0,0,2,0,0,0,0,0,{"$f":"SUM(MID(J40,ROW(INDIRECT(\"h1:H\"&LEN(J40))),1)*1)","v":4},{"v":1.038982133188955,"d":"1.04"},72]
[35,"","macrofaell",1873,4,1761,"sc-dubendorf",4,{"v":0,"d":"0%"},"0220","OK","OK",4,2,0,0,2,0,0,0,0,0,{"$f":"SUM(MID(J41,ROW(INDIRECT(\"h1:H\"&LEN(J41))),1)*1)","v":4},{"v":0.9402028830752803,"d":"0.94"},{"v":-112,"d":"-112 "}]
[36,"","centirel",1996,4,1720,"schachclub-ubs-zurich",4,{"v":0,"d":"0%"},"0220","OK","OK",4,2,0,0,2,0,0,0,0,0,{"$f":"SUM(MID(J42,ROW(INDIRECT(\"h1:H\"&LEN(J42))),1)*1)","v":4},{"v":0.8617234468937875,"d":"0.86"},{"v":-276,"d":"-276 "}]
[37,"","ursheu43",1578,4,1644,"sk-zollikofen-2",10,{"v":0,"d":"0%"},"0200200000","OK","OK",10,2,0,0,8,0,0,0,0,0,{"$f":"SUM(MID(J43,ROW(INDIRECT(\"h1:H\"&LEN(J43))),1)*1)","v":4},{"v":1.0418250950570342,"d":"1.04"},66]
[38,"","libero52",1363,4,1620,"sk-zollikofen-2",5,{"v":0,"d":"0%"},"00220","OK","OK",5,2,0,0,3,0,0,0,0,0,{"$f":"SUM(MID(J44,ROW(INDIRECT(\"h1:H\"&LEN(J44))),1)*1)","v":4},{"v":1.1885546588407925,"d":"1.19"},257]
[39,"","eliasmesserli08",1226,4,1307,"sk-zollikofen-2",8,{"v":0.13,"d":"13%"},"20000020","OK","OK",8,2,0,0,6,{"v":1.04,"d":"1"},1,0,1,0,{"$f":"SUM(MID(J45,ROW(INDIRECT(\"h1:H\"&LEN(J45))),1)*1)","v":4},{"v":1.066068515497553,"d":"1.07"},81]
[40,"","Paul-26b",1375,4,1278,"schachgesellschaft-winterthur",10,{"v":0,"d":"0%"},"0002002000","OK","OK",10,2,0,0,8,0,0,0,0,0,{"$f":"SUM(MID(J46,ROW(INDIRECT(\"h1:H\"&LEN(J46))),1)*1)","v":4},{"v":0.9294545454545454,"d":"0.93"},{"v":-97,"d":"-97 "}]
[41,"","Riquet065",1601,3,1528,"vevey",6,{"v":0,"d":"0%"},"020100","OK","OK",6,1,1,0,4,0,0,0,0,0,{"$f":"SUM(MID(J47,ROW(INDIRECT(\"h1:H\"&LEN(J47))),1)*1)","v":3},{"v":0.9544034978138664,"d":"0.95"},{"v":-73,"d":"-73 "}]
[42,"","keboo83",1837,2,1287,"sc-dubendorf",3,{"v":0.33,"d":"33%"},"020","OK","OK",3,1,0,0,2,{"v":0.99,"d":"1"},1,0,1,0,{"$f":"SUM(MID(J48,ROW(INDIRECT(\"h1:H\"&LEN(J48))),1)*1)","v":2},{"v":0.7005988023952096,"d":"0.70"},{"v":-550,"d":"-550 "}]
[43,"","Maximus_Knight",2267,0,null,"team-ticino",0,{"v":0,"d":"0%"},null,{"$error":"#REF!"},"",0,0,0,0,0,0,0,0,0,0,{"$f":"SUM(MID(J49,ROW(INDIRECT(\"h1:H\"&LEN(J49))),1)*1)","v":{"$error":"#REF!"}},{"v":0,"d":"0.00"},{"v":-2267,"d":"-2267 "}]
[44,"","Gerry3005",2093,0,null,"schachgesellschaft-riehen",0,{"v":0,"d":"0%"},null,{"$error":"#REF!"},"",0,0,0,0,0,0,0,0,0,0,{"$f":"SUM(MID(J50,ROW(INDIRECT(\"h1:H\"&LEN(J50))),1)*1)","v":{"$error":"#REF!"}},{"v":0,"d":"0.00"},{"v":-2093,"d":"-2093 "}]
[45,"","trucbidule33",1707,0,1663,"union-valaisanne-2",2,{"v":0,"d":"0%"},"00","OK","OK",2,0,0,0,2,0,0,0,0,0,{"$f":"SUM(MID(J51,ROW(INDIRECT(\"h1:H\"&LEN(J51))),1)*1)","v":0},{"v":0.974223784417106,"d":"0.97"},{"v":-44,"d":"-44 "}]
[46,"","MaxBor8",1500,0,null,"sk-zollikofen-2",0,{"v":0,"d":"0%"},null,{"$error":"#REF!"},"",0,0,0,0,0,0,0,0,0,0,{"$f":"SUM(MID(J52,ROW(INDIRECT(\"h1:H\"&LEN(J52))),1)*1)","v":{"$error":"#REF!"}},{"v":0,"d":"0.00"},{"v":-1500,"d":"-1500 "}]
[47,"","lelelarghi",2065,0,1464,"union-valaisanne-2",1,{"v":0,"d":"0%"},"0","OK","OK",1,0,0,0,1,0,0,0,0,0,{"$f":"SUM(MID(J53,ROW(INDIRECT(\"h1:H\"&LEN(J53))),1)*1)","v":0},{"v":0.7089588377723971,"d":"0.71"},{"v":-601,"d":"-601 "}]
[48,"","Akio5000",1022,0,1178,"vevey",11,{"v":0,"d":"0%"},"00000000000","OK","OK",11,0,0,0,11,0,0,0,0,0,{"$f":"SUM(MID(J54,ROW(INDIRECT(\"h1:H\"&LEN(J54))),1)*1)","v":0},{"v":1.152641878669276,"d":"1.15"},156]
[{"$nulls":8},{"v":0,"d":"0%"},null,{"$error":"#REF!"},"",0,0,0,0,0,0,0,0,0,0,{"$f":"SUM(MID(J55,ROW(INDIRECT(\"h1:H\"&LEN(J55))),1)*1)","v":{"$error":"#REF!"}},{"$error":"#DIV/0!"},0]
[{"$nulls":8},{"v":0,"d":"0%"},null,{"$error":"#REF!"},"",0,0,0,0,0,0,0,0,0,0,{"$f":"SUM(MID(J56,ROW(INDIRECT(\"h1:H\"&LEN(J56))),1)*1)","v":{"$error":"#REF!"}},{"$error":"#DIV/0!"},0]
[{"$nulls":8},{"v":0,"d":"0%"},null,{"$error":"#REF!"},"",0,0,0,0,0,0,0,0,0,0,{"$f":"SUM(MID(J57,ROW(INDIRECT(\"h1:H\"&LEN(J57))),1)*1)","v":{"$error":"#REF!"}},{"$error":"#DIV/0!"},0]
[{"$nulls":8},{"v":0,"d":"0%"},null,{"$error":"#REF!"},"",0,0,0,0,0,0,0,0,0,0,{"$f":"SUM(MID(J58,ROW(INDIRECT(\"h1:H\"&LEN(J58))),1)*1)","v":{"$error":"#REF!"}},{"$error":"#DIV/0!"},0]
[{"$nulls":8},{"v":0,"d":"0%"},null,{"$error":"#REF!"},"",0,0,0,0,0,0,0,0,0,0,{"$f":"SUM(MID(J59,ROW(INDIRECT(\"h1:H\"&LEN(J59))),1)*1)","v":{"$error":"#REF!"}},{"$error":"#DIV/0!"},0]
[{"$nulls":8},{"v":0,"d":"0%"},null,{"$error":"#REF!"},"",0,0,0,0,0,0,0,0,0,0,{"$f":"SUM(MID(J60,ROW(INDIRECT(\"h1:H\"&LEN(J60))),1)*1)","v":{"$error":"#REF!"}},{"$error":"#DIV/0!"},0]
[{"$nulls":8},{"v":0,"d":"0%"},null,{"$error":"#REF!"},"",0,0,0,0,0,0,0,0,0,0,{"$f":"SUM(MID(J61,ROW(INDIRECT(\"h1:H\"&LEN(J61))),1)*1)","v":{"$error":"#REF!"}},{"$error":"#DIV/0!"},0]
[{"$nulls":8},{"v":0,"d":"0%"},null,{"$error":"#REF!"},"",0,0,0,0,0,0,0,0,0,0,{"$f":"SUM(MID(J62,ROW(INDIRECT(\"h1:H\"&LEN(J62))),1)*1)","v":{"$error":"#REF!"}},{"$error":"#DIV/0!"},0]
[{"$nulls":8},{"v":0,"d":"0%"},null,{"$error":"#REF!"},"",0,0,0,0,0,0,0,0,0,0,{"$f":"SUM(MID(J63,ROW(INDIRECT(\"h1:H\"&LEN(J63))),1)*1)","v":{"$error":"#REF!"}},{"$error":"#DIV/0!"},0]
[{"$nulls":8},{"v":0,"d":"0%"},null,{"$error":"#REF!"},"",0,0,0,0,0,0,0,0,0,0,{"$f":"SUM(MID(J64,ROW(INDIRECT(\"h1:H\"&LEN(J64))),1)*1)","v":{"$error":"#REF!"}},{"$error":"#DIV/0!"},0]
[{"$nulls":8},{"v":0,"d":"0%"},null,{"$error":"#REF!"},"",0,0,0,0,0,0,0,0,0,0,{"$f":"SUM(MID(J65,ROW(INDIRECT(\"h1:H\"&LEN(J65))),1)*1)","v":{"$error":"#REF!"}},{"$error":"#DIV/0!"},0]
[{"$nulls":8},{"v":0,"d":"0%"},null,{"$error":"#REF!"},"",0,0,0,0,0,0,0,0,0,0,{"$f":"SUM(MID(J66,ROW(INDIRECT(\"h1:H\"&LEN(J66))),1)*1)","v":{"$error":"#REF!"}},{"$error":"#DIV/0!"},0]
[{"$nulls":8},{"v":0,"d":"0%"},null,{"$error":"#REF!"},"",0,0,0,0,0,0,0,0,0,0,{"$f":"SUM(MID(J67,ROW(INDIRECT(\"h1:H\"&LEN(J67))),1)*1)","v":{"$error":"#REF!"}},{"$error":"#DIV/0!"},0]
[{"$nulls":8},{"v":0,"d":"0%"},null,{"$error":"#REF!"},"",0,0,0,0,0,0,0,0,0,0,{"$f":"SUM(MID(J68,ROW(INDIRECT(\"h1:H\"&LEN(J68))),1)*1)","v":{"$error":"#REF!"}},{"$error":"#DIV/0!"},0]
[{"$nulls":8},{"v":0,"d":"0%"},null,{"$error":"#REF!"},"",0,0,0,0,0,0,0,0,0,0,{"$f":"SUM(MID(J69,ROW(INDIRECT(\"h1:H\"&LEN(J69))),1)*1)","v":{"$error":"#REF!"}},{"$error":"#DIV/0!"},0]
[{"$nulls":8},{"v":0,"d":"0%"},null,{"$error":"#REF!"},"",0,0,0,0,0,0,0,0,0,0,{"$f":"SUM(MID(J70,ROW(INDIRECT(\"h1:H\"&LEN(J70))),1)*1)","v":{"$error":"#REF!"}},{"$error":"#DIV/0!"},0]
[{"$nulls":8},{"v":0,"d":"0%"},null,{"$f":"IF(W71=E71,\"OK\",\"Falsch\")","v":{"$error":"#REF!"}},"",{"$f":"LEN(J71)","v":0},0,{"$f":"M71-LEN(SUBSTITUTE(J71,\"1\",\"\"))+P71","v":0},0,{"$f":"M71-LEN(SUBSTITUTE(J71,\"0\",\"\"))","v":0},{"$f":"I71*M71","v":0},0,{"$f":"M71-(M71-(LEN(J71)-LEN(SUBSTITUTE(J71,\"3\",\"\"))))+M71-(M71-(LEN(J71)-LEN(SUBSTITUTE(J71,\"5\",\"\"))))","v":0},0,{"$f":"M71-(M71-(LEN(J71)-LEN(SUBSTITUTE(J71,\"4\",\"\"))))+M71-(M71-(LEN(J71)-LEN(SUBSTITUTE(J71,\"5\",\"\"))))","v":0},{"$f":"SUM(MID(J71,ROW(INDIRECT(\"h1:H\"&LEN(J71))),1)*1)","v":{"$error":"#REF!"}},{"$error":"#DIV/0!"},0]
[{"$nulls":8},{"v":0,"d":"0%"},null,{"$error":"#REF!"},{"$f":"IF(H72=0,\"\",IF(M72=H72,\"OK\",\"Falsch\"))","v":""},0,{"$f":"M72-(M72-LEN(SUBSTITUTE(J72,\"0\",\"\")))-(M72-LEN(SUBSTITUTE(J72,\"1\",\"\")))-P72","v":0},0,{"$f":"IF($Z$7=\"J\",(M72-LEN(SUBSTITUTE(J72,\"42\",\"\")))/2+(M72-LEN(SUBSTITUTE(J72,\"222\",\"\")))/3,0)","v":0},0,0,{"$f":"ROUND(R72,0)","v":0},0,{"$f":"S72-T72","v":0},0,{"$f":"SUM(MID(J72,ROW(INDIRECT(\"h1:H\"&LEN(J72))),1)*1)","v":{"$error":"#REF!"}},{"$f":"F72/D72","v":{"$error":"#DIV/0!"}},{"$f":"F72-D72","v":0}]
[{"$nulls":8},{"v":0,"d":"0%"},null,{"$error":"#REF!"},"",0,0,0,0,0,0,0,0,0,0,{"$f":"SUM(MID(J73,ROW(INDIRECT(\"h1:H\"&LEN(J73))),1)*1)","v":{"$error":"#REF!"}},{"$error":"#DIV/0!"},0]
[{"$nulls":8},{"v":0,"d":"0%"},null,{"$error":"#REF!"},"",0,0,0,0,0,0,0,0,0,0,{"$f":"SUM(MID(J74,ROW(INDIRECT(\"h1:H\"&LEN(J74))),1)*1)","v":{"$error":"#REF!"}},{"$error":"#DIV/0!"},0]
[{"$nulls":8},{"v":0,"d":"0%"},null,{"$error":"#REF!"},"",0,0,0,0,0,0,0,0,0,0,{"$f":"SUM(MID(J75,ROW(INDIRECT(\"h1:H\"&LEN(J75))),1)*1)","v":{"$error":"#REF!"}},{"$error":"#DIV/0!"},0]
[{"$nulls":8},{"v":0,"d":"0%"},null,{"$error":"#REF!"},"",0,0,0,0,0,0,0,0,0,0,{"$f":"SUM(MID(J76,ROW(INDIRECT(\"h1:H\"&LEN(J76))),1)*1)","v":{"$error":"#REF!"}},{"$error":"#DIV/0!"},0]
[{"$nulls":8},{"v":0,"d":"0%"},null,{"$error":"#REF!"},"",0,0,0,0,0,0,0,0,0,0,{"$f":"SUM(MID(J77,ROW(INDIRECT(\"h1:H\"&LEN(J77))),1)*1)","v":{"$error":"#REF!"}},{"$error":"#DIV/0!"},0]
[{"$nulls":8},{"v":0,"d":"0%"},null,{"$error":"#REF!"},"",0,0,0,0,0,0,0,0,0,0,{"$f":"SUM(MID(J78,ROW(INDIRECT(\"h1:H\"&LEN(J78))),1)*1)","v":{"$error":"#REF!"}},{"$error":"#DIV/0!"},0]
[{"$nulls":8},{"v":0,"d":"0%"},null,{"$error":"#REF!"},"",0,0,0,0,0,0,0,0,0,0,{"$f":"SUM(MID(J79,ROW(INDIRECT(\"h1:H\"&LEN(J79))),1)*1)","v":{"$error":"#REF!"}},{"$error":"#DIV/0!"},0]
[{"$nulls":8},{"v":0,"d":"0%"},null,{"$error":"#REF!"},"",0,0,0,0,0,0,0,0,0,0,{"$f":"SUM(MID(J80,ROW(INDIRECT(\"h1:H\"&LEN(J80))),1)*1)","v":{"$error":"#REF!"}},{"$error":"#DIV/0!"},0]
[{"$nulls":8},{"v":0,"d":"0%"},null,{"$error":"#REF!"},"",0,0,0,0,0,0,0,0,0,0,{"$f":"SUM(MID(J81,ROW(INDIRECT(\"h1:H\"&LEN(J81))),1)*1)","v":{"$error":"#REF!"}},{"$error":"#DIV/0!"},0]
[{"$nulls":8},{"v":0,"d":"0%"},null,{"$error":"#REF!"},"",0,0,0,0,0,0,0,0,0,0,{"$f":"SUM(MID(J82,ROW(INDIRECT(\"h1:H\"&LEN(J82))),1)*1)","v":{"$error":"#REF!"}},{"$error":"#DIV/0!"},0]
[{"$nulls":8},{"v":0,"d":"0%"},null,{"$error":"#REF!"},"",0,0,0,0,0,0,0,0,0,0,{"$f":"SUM(MID(J83,ROW(INDIRECT(\"h1:H\"&LEN(J83))),1)*1)","v":{"$error":"#REF!"}},{"$error":"#DIV/0!"},0]
[{"$nulls":8},{"v":0,"d":"0%"},null,{"$error":"#REF!"},"",0,0,0,0,0,0,0,0,0,0,{"$f":"SUM(MID(J84,ROW(INDIRECT(\"h1:H\"&LEN(J84))),1)*1)","v":{"$error":"#REF!"}},{"$error":"#DIV/0!"},0]
[{"$nulls":8},{"v":0,"d":"0%"},null,{"$error":"#REF!"},"",0,0,0,0,0,0,0,0,0,0,{"$f":"SUM(MID(J85,ROW(INDIRECT(\"h1:H\"&LEN(J85))),1)*1)","v":{"$error":"#REF!"}},{"$error":"#DIV/0!"},0]
[{"$nulls":8},{"v":0,"d":"0%"},null,{"$error":"#REF!"},"",0,0,0,0,0,0,0,0,0,0,{"$f":"SUM(MID(J86,ROW(INDIRECT(\"h1:H\"&LEN(J86))),1)*1)","v":{"$error":"#REF!"}},{"$error":"#DIV/0!"},0]
[{"$nulls":8},{"v":0,"d":"0%"},null,{"$error":"#REF!"},"",0,0,0,0,0,0,0,0,0,0,{"$f":"SUM(MID(J87,ROW(INDIRECT(\"h1:H\"&LEN(J87))),1)*1)","v":{"$error":"#REF!"}},{"$error":"#DIV/0!"},0]
[{"$nulls":8},{"v":0,"d":"0%"},null,{"$error":"#REF!"},"",0,0,0,0,0,0,0,0,0,0,{"$f":"SUM(MID(J88,ROW(INDIRECT(\"h1:H\"&LEN(J88))),1)*1)","v":{"$error":"#REF!"}},{"$error":"#DIV/0!"},0]
[{"$nulls":8},{"v":0,"d":"0%"},null,{"$error":"#REF!"},"",0,0,0,0,0,0,0,0,0,0,{"$f":"SUM(MID(J89,ROW(INDIRECT(\"h1:H\"&LEN(J89))),1)*1)","v":{"$error":"#REF!"}},{"$error":"#DIV/0!"},0]
[{"$nulls":8},{"v":0,"d":"0%"},null,{"$error":"#REF!"},"",0,0,0,0,0,0,0,0,0,0,{"$f":"SUM(MID(J90,ROW(INDIRECT(\"h1:H\"&LEN(J90))),1)*1)","v":{"$error":"#REF!"}},{"$error":"#DIV/0!"},0]
[{"$nulls":8},{"v":0,"d":"0%"},null,{"$error":"#REF!"},"",0,0,0,0,0,0,0,0,0,0,{"$f":"SUM(MID(J91,ROW(INDIRECT(\"h1:H\"&LEN(J91))),1)*1)","v":{"$error":"#REF!"}},{"$error":"#DIV/0!"},0]
[{"$nulls":8},{"v":0,"d":"0%"},null,{"$error":"#REF!"},"",0,0,0,0,0,0,0,0,0,0,{"$f":"SUM(MID(J92,ROW(INDIRECT(\"h1:H\"&LEN(J92))),1)*1)","v":{"$error":"#REF!"}},{"$error":"#DIV/0!"},0]
[{"$nulls":8},{"v":0,"d":"0%"},null,{"$error":"#REF!"},"",0,0,0,0,0,0,0,0,0,0,{"$f":"SUM(MID(J93,ROW(INDIRECT(\"h1:H\"&LEN(J93))),1)*1)","v":{"$error":"#REF!"}},{"$error":"#DIV/0!"},0]
[{"$nulls":8},{"v":0,"d":"0%"},null,{"$error":"#REF!"},"",0,0,0,0,0,0,0,0,0,0,{"$f":"SUM(MID(J94,ROW(INDIRECT(\"h1:H\"&LEN(J94))),1)*1)","v":{"$error":"#REF!"}},{"$error":"#DIV/0!"},0]
[{"$nulls":8},{"v":0,"d":"0%"},null,{"$error":"#REF!"},"",0,0,0,0,0,0,0,0,0,0,{"$f":"SUM(MID(J95,ROW(INDIRECT(\"h1:H\"&LEN(J95))),1)*1)","v":{"$error":"#REF!"}},{"$error":"#DIV/0!"},0]
[{"$nulls":8},{"v":0,"d":"0%"},null,{"$error":"#REF!"},"",0,0,0,0,0,0,0,0,0,0,{"$f":"SUM(MID(J96,ROW(INDIRECT(\"h1:H\"&LEN(J96))),1)*1)","v":{"$error":"#REF!"}},{"$error":"#DIV/0!"},0]
[{"$nulls":8},{"v":0,"d":"0%"},null,{"$error":"#REF!"},"",0,0,0,0,0,0,0,0,0,0,{"$f":"SUM(MID(J97,ROW(INDIRECT(\"h1:H\"&LEN(J97))),1)*1)","v":{"$error":"#REF!"}},{"$error":"#DIV/0!"},0]
[{"$nulls":8},{"v":0,"d":"0%"},null,{"$error":"#REF!"},"",0,0,0,0,0,0,0,0,0,0,{"$f":"SUM(MID(J98,ROW(INDIRECT(\"h1:H\"&LEN(J98))),1)*1)","v":{"$error":"#REF!"}},{"$error":"#DIV/0!"},0]
[{"$nulls":8},{"v":0,"d":"0%"},null,{"$error":"#REF!"},"",0,0,0,0,0,0,0,0,0,0,{"$f":"SUM(MID(J99,ROW(INDIRECT(\"h1:H\"&LEN(J99))),1)*1)","v":{"$error":"#REF!"}},{"$error":"#DIV/0!"},0]
[{"$nulls":8},{"v":0,"d":"0%"},null,{"$error":"#REF!"},"",0,0,0,0,0,0,0,0,0,0,{"$f":"SUM(MID(J100,ROW(INDIRECT(\"h1:H\"&LEN(J100))),1)*1)","v":{"$error":"#REF!"}},{"$error":"#DIV/0!"},0]
[{"$nulls":8},{"v":0,"d":"0%"},null,{"$error":"#REF!"},"",0,0,0,0,0,0,0,0,0,0,{"$f":"SUM(MID(J101,ROW(INDIRECT(\"h1:H\"&LEN(J101))),1)*1)","v":{"$error":"#REF!"}},{"$error":"#DIV/0!"},0]
[{"$nulls":8},{"v":0,"d":"0%"},null,{"$error":"#REF!"},"",0,0,0,0,0,0,0,0,0,0,{"$f":"SUM(MID(J102,ROW(INDIRECT(\"h1:H\"&LEN(J102))),1)*1)","v":{"$error":"#REF!"}},{"$error":"#DIV/0!"},0]
[{"$nulls":8},{"v":0,"d":"0%"},null,{"$error":"#REF!"},"",0,0,0,0,0,0,0,0,0,0,{"$f":"SUM(MID(J103,ROW(INDIRECT(\"h1:H\"&LEN(J103))),1)*1)","v":{"$error":"#REF!"}},{"$error":"#DIV/0!"},0]
[{"$nulls":8},{"v":0,"d":"0%"},null,{"$error":"#REF!"},"",0,0,0,0,0,0,0,0,0,0,{"$f":"SUM(MID(J104,ROW(INDIRECT(\"h1:H\"&LEN(J104))),1)*1)","v":{"$error":"#REF!"}},{"$error":"#DIV/0!"},0]
[{"$nulls":8},{"v":0,"d":"0%"},null,{"$error":"#REF!"},"",0,0,0,0,0,0,0,0,0,0,{"$f":"SUM(MID(J105,ROW(INDIRECT(\"h1:H\"&LEN(J105))),1)*1)","v":{"$error":"#REF!"}},{"$error":"#DIV/0!"},0]
[{"$nulls":8},{"v":0,"d":"0%"},null,{"$error":"#REF!"},"",0,0,0,0,0,0,0,0,0,0,{"$f":"SUM(MID(J106,ROW(INDIRECT(\"h1:H\"&LEN(J106))),1)*1)","v":{"$error":"#REF!"}},{"$error":"#DIV/0!"},0]
[{"$nulls":8},{"v":0,"d":"0%"},null,{"$error":"#REF!"},"",0,0,0,0,0,0,0,0,0,0,{"$f":"SUM(MID(J107,ROW(INDIRECT(\"h1:H\"&LEN(J107))),1)*1)","v":{"$error":"#REF!"}},{"$error":"#DIV/0!"},0]
[{"$nulls":8},{"v":0,"d":"0%"},null,{"$error":"#REF!"},"",0,0,0,0,0,0,0,0,0,0,{"$f":"SUM(MID(J108,ROW(INDIRECT(\"h1:H\"&LEN(J108))),1)*1)","v":{"$error":"#REF!"}},{"$error":"#DIV/0!"},0]
[{"$nulls":8},{"v":0,"d":"0%"},null,{"$error":"#REF!"},"",0,0,0,0,0,0,0,0,0,0,{"$f":"SUM(MID(J109,ROW(INDIRECT(\"h1:H\"&LEN(J109))),1)*1)","v":{"$error":"#REF!"}},{"$error":"#DIV/0!"},0]
[{"$nulls":8},{"v":0,"d":"0%"},null,{"$error":"#REF!"},"",0,0,0,0,0,0,0,0,0,0,{"$f":"SUM(MID(J110,ROW(INDIRECT(\"h1:H\"&LEN(J110))),1)*1)","v":{"$error":"#REF!"}},{"$error":"#DIV/0!"},0]
[{"$nulls":8},{"v":0,"d":"0%"},null,{"$error":"#REF!"},"",0,0,0,0,0,0,0,0,0,0,{"$f":"SUM(MID(J111,ROW(INDIRECT(\"h1:H\"&LEN(J111))),1)*1)","v":{"$error":"#REF!"}},{"$error":"#DIV/0!"},0]
[{"$nulls":8},{"v":0,"d":"0%"},null,{"$error":"#REF!"},"",0,0,0,0,0,0,0,0,0,0,{"$f":"SUM(MID(J112,ROW(INDIRECT(\"h1:H\"&LEN(J112))),1)*1)","v":{"$error":"#REF!"}},{"$error":"#DIV/0!"},0]
[{"$nulls":8},{"v":0,"d":"0%"},null,{"$error":"#REF!"},"",0,0,0,0,0,0,0,0,0,0,{"$f":"SUM(MID(J113,ROW(INDIRECT(\"h1:H\"&LEN(J113))),1)*1)","v":{"$error":"#REF!"}},{"$error":"#DIV/0!"},0]
[{"$nulls":8},{"v":0,"d":"0%"},null,{"$error":"#REF!"},"",0,0,0,0,0,0,0,0,0,0,{"$f":"SUM(MID(J114,ROW(INDIRECT(\"h1:H\"&LEN(J114))),1)*1)","v":{"$error":"#REF!"}},{"$error":"#DIV/0!"},0]
[{"$nulls":8},{"v":0,"d":"0%"},null,{"$error":"#REF!"},"",0,0,0,0,0,0,0,0,0,0,{"$f":"SUM(MID(J115,ROW(INDIRECT(\"h1:H\"&LEN(J115))),1)*1)","v":{"$error":"#REF!"}},{"$error":"#DIV/0!"},0]
[{"$nulls":8},{"v":0,"d":"0%"},null,{"$error":"#REF!"},"",0,0,0,0,0,0,0,0,0,0,{"$f":"SUM(MID(J116,ROW(INDIRECT(\"h1:H\"&LEN(J116))),1)*1)","v":{"$error":"#REF!"}},{"$error":"#DIV/0!"},0]
[{"$nulls":8},{"v":0,"d":"0%"},null,{"$error":"#REF!"},"",0,0,0,0,0,0,0,0,0,0,{"$f":"SUM(MID(J117,ROW(INDIRECT(\"h1:H\"&LEN(J117))),1)*1)","v":{"$error":"#REF!"}},{"$error":"#DIV/0!"},0]
[{"$nulls":8},{"v":0,"d":"0%"},null,{"$error":"#REF!"},"",0,0,0,0,0,0,0,0,0,0,{"$f":"SUM(MID(J118,ROW(INDIRECT(\"h1:H\"&LEN(J118))),1)*1)","v":{"$error":"#REF!"}},{"$error":"#DIV/0!"},0]
[{"$nulls":8},{"v":0,"d":"0%"},null,{"$error":"#REF!"},"",0,0,0,0,0,0,0,0,0,0,{"$f":"SUM(MID(J119,ROW(INDIRECT(\"h1:H\"&LEN(J119))),1)*1)","v":{"$error":"#REF!"}},{"$error":"#DIV/0!"},0]
[{"$nulls":8},{"v":0,"d":"0%"},null,{"$error":"#REF!"},"",0,0,0,0,0,0,0,0,0,0,{"$f":"SUM(MID(J120,ROW(INDIRECT(\"h1:H\"&LEN(J120))),1)*1)","v":{"$error":"#REF!"}},{"$error":"#DIV/0!"},0]
[{"$nulls":8},{"v":0,"d":"0%"},null,{"$error":"#REF!"},"",0,0,0,0,0,0,0,0,0,0,{"$f":"SUM(MID(J121,ROW(INDIRECT(\"h1:H\"&LEN(J121))),1)*1)","v":{"$error":"#REF!"}},{"$error":"#DIV/0!"},0]
[{"$nulls":8},{"v":0,"d":"0%"},null,{"$error":"#REF!"},"",0,0,0,0,0,0,0,0,0,0,{"$f":"SUM(MID(J122,ROW(INDIRECT(\"h1:H\"&LEN(J122))),1)*1)","v":{"$error":"#REF!"}},{"$error":"#DIV/0!"},0]
[{"$nulls":8},{"v":0,"d":"0%"},null,{"$error":"#REF!"},"",0,0,0,0,0,0,0,0,0,0,{"$f":"SUM(MID(J123,ROW(INDIRECT(\"h1:H\"&LEN(J123))),1)*1)","v":{"$error":"#REF!"}},{"$error":"#DIV/0!"},0]
[{"$nulls":8},{"v":0,"d":"0%"},null,{"$error":"#REF!"},"",0,0,0,0,0,0,0,0,0,0,{"$f":"SUM(MID(J124,ROW(INDIRECT(\"h1:H\"&LEN(J124))),1)*1)","v":{"$error":"#REF!"}},{"$error":"#DIV/0!"},0]
[{"$nulls":8},{"v":0,"d":"0%"},null,{"$error":"#REF!"},"",0,0,0,0,0,0,0,0,0,0,{"$f":"SUM(MID(J125,ROW(INDIRECT(\"h1:H\"&LEN(J125))),1)*1)","v":{"$error":"#REF!"}},{"$error":"#DIV/0!"},0]
[{"$nulls":8},{"v":0,"d":"0%"},null,{"$error":"#REF!"},"",0,0,0,0,0,0,0,0,0,0,{"$f":"SUM(MID(J126,ROW(INDIRECT(\"h1:H\"&LEN(J126))),1)*1)","v":{"$error":"#REF!"}},{"$error":"#DIV/0!"},0]
[{"$nulls":8},{"v":0,"d":"0%"},null,{"$error":"#REF!"},"",0,0,0,0,0,0,0,0,0,0,{"$f":"SUM(MID(J127,ROW(INDIRECT(\"h1:H\"&LEN(J127))),1)*1)","v":{"$error":"#REF!"}},{"$error":"#DIV/0!"},0]
[{"$nulls":8},{"v":0,"d":"0%"},null,{"$error":"#REF!"},"",0,0,{"$f":"M128-LEN(SUBSTITUTE(J128,\"1\",\"\"))+P128","v":0},0,0,0,0,0,0,0,{"$f":"SUM(MID(J128,ROW(INDIRECT(\"h1:H\"&LEN(J128))),1)*1)","v":{"$error":"#REF!"}},{"$error":"#DIV/0!"},0]
[{"$nulls":8},{"v":0,"d":"0%"},null,{"$error":"#REF!"},"",0,0,{"$f":"M129-LEN(SUBSTITUTE(J129,\"1\",\"\"))+P129","v":0},0,0,0,0,0,0,0,{"$f":"SUM(MID(J129,ROW(INDIRECT(\"h1:H\"&LEN(J129))),1)*1)","v":{"$error":"#REF!"}},{"$error":"#DIV/0!"},0]
[{"$nulls":8},{"v":0,"d":"0%"},null,{"$error":"#REF!"},"",0,0,0,0,0,0,0,0,0,0,{"$f":"SUM(MID(J130,ROW(INDIRECT(\"h1:H\"&LEN(J130))),1)*1)","v":{"$error":"#REF!"}},{"$error":"#DIV/0!"},0]
[{"$nulls":8},{"v":0,"d":"0%"},null,{"$error":"#REF!"},"",0,0,0,0,0,0,0,0,0,0,{"$f":"SUM(MID(J131,ROW(INDIRECT(\"h1:H\"&LEN(J131))),1)*1)","v":{"$error":"#REF!"}},{"$error":"#DIV/0!"},0]
[{"$nulls":8},{"v":0,"d":"0%"},null,{"$error":"#REF!"},"",0,0,0,0,0,0,0,0,0,0,{"$f":"SUM(MID(J132,ROW(INDIRECT(\"h1:H\"&LEN(J132))),1)*1)","v":{"$error":"#REF!"}},{"$error":"#DIV/0!"},0]
[{"$nulls":8},{"v":0,"d":"0%"},null,{"$error":"#REF!"},"",0,0,0,0,0,0,0,0,0,0,{"$f":"SUM(MID(J133,ROW(INDIRECT(\"h1:H\"&LEN(J133))),1)*1)","v":{"$error":"#REF!"}},{"$error":"#DIV/0!"},0]
[{"$nulls":8},{"v":0,"d":"0%"},null,{"$error":"#REF!"},"",0,0,0,0,0,0,0,0,0,0,{"$f":"SUM(MID(J134,ROW(INDIRECT(\"h1:H\"&LEN(J134))),1)*1)","v":{"$error":"#REF!"}},{"$error":"#DIV/0!"},0]
[{"$nulls":8},{"v":0,"d":"0%"},null,{"$f":"IF(W135=E135,\"OK\",\"Falsch\")","v":{"$error":"#REF!"}},"",{"$f":"LEN(J135)","v":0},0,0,0,{"$f":"M135-LEN(SUBSTITUTE(J135,\"0\",\"\"))","v":0},{"$f":"I135*M135","v":0},0,{"$f":"M135-(M135-(LEN(J135)-LEN(SUBSTITUTE(J135,\"3\",\"\"))))+M135-(M135-(LEN(J135)-LEN(SUBSTITUTE(J135,\"5\",\"\"))))","v":0},0,{"$f":"M135-(M135-(LEN(J135)-LEN(SUBSTITUTE(J135,\"4\",\"\"))))+M135-(M135-(LEN(J135)-LEN(SUBSTITUTE(J135,\"5\",\"\"))))","v":0},{"$f":"SUM(MID(J135,ROW(INDIRECT(\"h1:H\"&LEN(J135))),1)*1)","v":{"$error":"#REF!"}},{"$error":"#DIV/0!"},0]
[{"$nulls":8},{"v":0,"d":"0%"},null,{"$error":"#REF!"},{"$f":"IF(H136=0,\"\",IF(M136=H136,\"OK\",\"Falsch\"))","v":""},0,{"$f":"M136-(M136-LEN(SUBSTITUTE(J136,\"0\",\"\")))-(M136-LEN(SUBSTITUTE(J136,\"1\",\"\")))-P136","v":0},0,{"$f":"IF($Z$7=\"J\",(M136-LEN(SUBSTITUTE(J136,\"42\",\"\")))/2+(M136-LEN(SUBSTITUTE(J136,\"222\",\"\")))/3,0)","v":0},0,0,{"$f":"ROUND(R136,0)","v":0},0,{"$f":"S136-T136","v":0},0,{"$f":"SUM(MID(J136,ROW(INDIRECT(\"h1:H\"&LEN(J136))),1)*1)","v":{"$error":"#REF!"}},{"$f":"F136/D136","v":{"$error":"#DIV/0!"}},{"$f":"F136-D136","v":0}]
[{"$nulls":8},{"v":0,"d":"0%"},null,{"$error":"#REF!"},"",0,0,0,0,0,0,0,0,0,0,{"$f":"SUM(MID(J137,ROW(INDIRECT(\"h1:H\"&LEN(J137))),1)*1)","v":{"$error":"#REF!"}},{"$error":"#DIV/0!"},0]
[{"$nulls":8},{"v":0,"d":"0%"},null,{"$error":"#REF!"},"",0,0,0,0,0,0,0,0,0,0,{"$f":"SUM(MID(J138,ROW(INDIRECT(\"h1:H\"&LEN(J138))),1)*1)","v":{"$error":"#REF!"}},{"$error":"#DIV/0!"},0]
[{"$nulls":8},{"v":0,"d":"0%"},null,{"$error":"#REF!"},"",0,0,0,0,0,0,0,0,0,0,{"$f":"SUM(MID(J139,ROW(INDIRECT(\"h1:H\"&LEN(J139))),1)*1)","v":{"$error":"#REF!"}},{"$error":"#DIV/0!"},0]
[{"$nulls":8},{"v":0,"d":"0%"},null,{"$error":"#REF!"},"",0,0,0,0,0,0,0,0,0,0,{"$f":"SUM(MID(J140,ROW(INDIRECT(\"h1:H\"&LEN(J140))),1)*1)","v":{"$error":"#REF!"}},{"$error":"#DIV/0!"},0]
[{"$nulls":8},{"v":0,"d":"0%"},null,{"$error":"#REF!"},"",0,0,0,0,0,0,0,0,0,0,{"$f":"SUM(MID(J141,ROW(INDIRECT(\"h1:H\"&LEN(J141))),1)*1)","v":{"$error":"#REF!"}},{"$error":"#DIV/0!"},0]
[{"$nulls":8},{"v":0,"d":"0%"},null,{"$error":"#REF!"},"",0,0,0,0,0,0,0,0,0,0,{"$f":"SUM(MID(J142,ROW(INDIRECT(\"h1:H\"&LEN(J142))),1)*1)","v":{"$error":"#REF!"}},{"$error":"#DIV/0!"},0]
[{"$nulls":8},{"v":0,"d":"0%"},null,{"$error":"#REF!"},"",0,0,0,0,0,0,0,0,0,0,{"$f":"SUM(MID(J143,ROW(INDIRECT(\"h1:H\"&LEN(J143))),1)*1)","v":{"$error":"#REF!"}},{"$error":"#DIV/0!"},0]
[{"$nulls":8},{"v":0,"d":"0%"},null,{"$error":"#REF!"},"",0,0,0,0,0,0,0,0,0,0,{"$f":"SUM(MID(J144,ROW(INDIRECT(\"h1:H\"&LEN(J144))),1)*1)","v":{"$error":"#REF!"}},{"$error":"#DIV/0!"},0]
[{"$nulls":8},{"v":0,"d":"0%"},null,{"$error":"#REF!"},"",0,0,0,0,0,0,0,0,0,0,{"$f":"SUM(MID(J145,ROW(INDIRECT(\"h1:H\"&LEN(J145))),1)*1)","v":{"$error":"#REF!"}},{"$error":"#DIV/0!"},0]
[{"$nulls":8},{"v":0,"d":"0%"},null,{"$error":"#REF!"},"",0,0,0,0,0,0,0,0,0,0,{"$f":"SUM(MID(J146,ROW(INDIRECT(\"h1:H\"&LEN(J146))),1)*1)","v":{"$error":"#REF!"}},{"$error":"#DIV/0!"},0]
[{"$nulls":8},{"v":0,"d":"0%"},null,{"$error":"#REF!"},"",0,0,0,0,0,0,0,0,0,0,{"$f":"SUM(MID(J147,ROW(INDIRECT(\"h1:H\"&LEN(J147))),1)*1)","v":{"$error":"#REF!"}},{"$error":"#DIV/0!"},0]
[{"$nulls":8},{"v":0,"d":"0%"},null,{"$error":"#REF!"},"",0,0,0,0,0,0,0,0,0,0,{"$f":"SUM(MID(J148,ROW(INDIRECT(\"h1:H\"&LEN(J148))),1)*1)","v":{"$error":"#REF!"}},{"$error":"#DIV/0!"},0]
[{"$nulls":8},{"v":0,"d":"0%"},null,{"$error":"#REF!"},"",0,0,0,0,0,0,0,0,0,0,{"$f":"SUM(MID(J149,ROW(INDIRECT(\"h1:H\"&LEN(J149))),1)*1)","v":{"$error":"#REF!"}},{"$error":"#DIV/0!"},0]
[{"$nulls":8},{"v":0,"d":"0%"},null,{"$error":"#REF!"},"",0,0,0,0,0,0,0,0,0,0,{"$f":"SUM(MID(J150,ROW(INDIRECT(\"h1:H\"&LEN(J150))),1)*1)","v":{"$error":"#REF!"}},{"$error":"#DIV/0!"},0]
[{"$nulls":8},{"v":0,"d":"0%"},null,{"$error":"#REF!"},"",0,0,0,0,0,0,0,0,0,0,{"$f":"SUM(MID(J151,ROW(INDIRECT(\"h1:H\"&LEN(J151))),1)*1)","v":{"$error":"#REF!"}},{"$error":"#DIV/0!"},0]
[{"$nulls":8},{"v":0,"d":"0%"},null,{"$error":"#REF!"},"",0,0,0,0,0,0,0,0,0,0,{"$f":"SUM(MID(J152,ROW(INDIRECT(\"h1:H\"&LEN(J152))),1)*1)","v":{"$error":"#REF!"}},{"$error":"#DIV/0!"},0]
[{"$nulls":8},{"v":0,"d":"0%"},null,{"$error":"#REF!"},"",0,0,0,0,0,0,0,0,0,0,{"$f":"SUM(MID(J153,ROW(INDIRECT(\"h1:H\"&LEN(J153))),1)*1)","v":{"$error":"#REF!"}},{"$error":"#DIV/0!"},0]
[{"$nulls":8},{"v":0,"d":"0%"},null,{"$error":"#REF!"},"",0,0,0,0,0,0,0,0,0,0,{"$f":"SUM(MID(J154,ROW(INDIRECT(\"h1:H\"&LEN(J154))),1)*1)","v":{"$error":"#REF!"}},{"$error":"#DIV/0!"},0]
[{"$nulls":8},{"v":0,"d":"0%"},null,{"$error":"#REF!"},"",0,0,0,0,0,0,0,0,0,0,{"$f":"SUM(MID(J155,ROW(INDIRECT(\"h1:H\"&LEN(J155))),1)*1)","v":{"$error":"#REF!"}},{"$error":"#DIV/0!"},0]
[{"$nulls":8},{"v":0,"d":"0%"},null,{"$error":"#REF!"},"",0,0,0,0,0,0,0,0,0,0,{"$f":"SUM(MID(J156,ROW(INDIRECT(\"h1:H\"&LEN(J156))),1)*1)","v":{"$error":"#REF!"}},{"$error":"#DIV/0!"},0]
[{"$nulls":8},{"v":0,"d":"0%"},null,{"$error":"#REF!"},"",0,0,0,0,0,0,0,0,0,0,{"$f":"SUM(MID(J157,ROW(INDIRECT(\"h1:H\"&LEN(J157))),1)*1)","v":{"$error":"#REF!"}},{"$error":"#DIV/0!"},0]
[{"$nulls":8},{"v":0,"d":"0%"},null,{"$error":"#REF!"},"",0,0,0,0,0,0,0,0,0,0,{"$f":"SUM(MID(J158,ROW(INDIRECT(\"h1:H\"&LEN(J158))),1)*1)","v":{"$error":"#REF!"}},{"$error":"#DIV/0!"},0]
[{"$nulls":8},{"v":0,"d":"0%"},null,{"$error":"#REF!"},"",0,0,0,0,0,0,0,0,0,0,{"$f":"SUM(MID(J159,ROW(INDIRECT(\"h1:H\"&LEN(J159))),1)*1)","v":{"$error":"#REF!"}},{"$error":"#DIV/0!"},0]
[{"$nulls":8},{"v":0,"d":"0%"},null,{"$error":"#REF!"},"",0,0,0,0,0,0,0,0,0,0,{"$f":"SUM(MID(J160,ROW(INDIRECT(\"h1:H\"&LEN(J160))),1)*1)","v":{"$error":"#REF!"}},{"$error":"#DIV/0!"},0]
[{"$nulls":8},{"v":0,"d":"0%"},null,{"$error":"#REF!"},"",0,0,0,0,0,0,0,0,0,0,{"$f":"SUM(MID(J161,ROW(INDIRECT(\"h1:H\"&LEN(J161))),1)*1)","v":{"$error":"#REF!"}},{"$error":"#DIV/0!"},0]
[{"$nulls":8},{"v":0,"d":"0%"},null,{"$error":"#REF!"},"",0,0,0,0,0,0,0,0,0,0,{"$f":"SUM(MID(J162,ROW(INDIRECT(\"h1:H\"&LEN(J162))),1)*1)","v":{"$error":"#REF!"}},{"$error":"#DIV/0!"},0]
[{"$nulls":8},{"v":0,"d":"0%"},null,{"$error":"#REF!"},"",0,0,0,0,0,0,0,0,0,0,{"$f":"SUM(MID(J163,ROW(INDIRECT(\"h1:H\"&LEN(J163))),1)*1)","v":{"$error":"#REF!"}},{"$error":"#DIV/0!"},0]
[158,"",{"$nulls":6},{"v":0,"d":"0%"},null,{"$error":"#REF!"},"",0,0,0,0,0,0,0,0,0,0,{"$f":"SUM(MID(J164,ROW(INDIRECT(\"h1:H\"&LEN(J164))),1)*1)","v":{"$error":"#REF!"}},{"$error":"#DIV/0!"},0]
[159,"",{"$nulls":6},{"v":0,"d":"0%"},null,{"$error":"#REF!"},"",0,0,0,0,0,0,0,0,0,0,{"$f":"SUM(MID(J165,ROW(INDIRECT(\"h1:H\"&LEN(J165))),1)*1)","v":{"$error":"#REF!"}},{"$error":"#DIV/0!"},0]
[160,"",{"$nulls":6},{"v":0,"d":"0%"},null,{"$error":"#REF!"},"",0,0,0,0,0,0,0,0,0,0,{"$f":"SUM(MID(J166,ROW(INDIRECT(\"h1:H\"&LEN(J166))),1)*1)","v":{"$error":"#REF!"}},{"$error":"#DIV/0!"},0]
[161,"",{"$nulls":6},{"v":0,"d":"0%"},null,{"$error":"#REF!"},"",0,0,0,0,0,0,0,0,0,0,{"$f":"SUM(MID(J167,ROW(INDIRECT(\"h1:H\"&LEN(J167))),1)*1)","v":{"$error":"#REF!"}},{"$error":"#DIV/0!"},0]
[162,"",{"$nulls":6},{"v":0,"d":"0%"},null,{"$error":"#REF!"},"",0,0,0,0,0,0,0,0,0,0,{"$f":"SUM(MID(J168,ROW(INDIRECT(\"h1:H\"&LEN(J168))),1)*1)","v":{"$error":"#REF!"}},{"$error":"#DIV/0!"},0]
[163,"",{"$nulls":6},{"v":0,"d":"0%"},null,{"$error":"#REF!"},"",0,0,0,0,0,0,0,0,0,0,{"$f":"SUM(MID(J169,ROW(INDIRECT(\"h1:H\"&LEN(J169))),1)*1)","v":{"$error":"#REF!"}},{"$error":"#DIV/0!"},0]
[164,"",{"$nulls":6},{"v":0,"d":"0%"},null,{"$error":"#REF!"},"",0,0,0,0,0,0,0,0,0,0,{"$f":"SUM(MID(J170,ROW(INDIRECT(\"h1:H\"&LEN(J170))),1)*1)","v":{"$error":"#REF!"}},{"$error":"#DIV/0!"},0]
[165,"",{"$nulls":6},{"v":0,"d":"0%"},null,{"$error":"#REF!"},"",0,0,0,0,0,0,0,0,0,0,{"$f":"SUM(MID(J171,ROW(INDIRECT(\"h1:H\"&LEN(J171))),1)*1)","v":{"$error":"#REF!"}},{"$error":"#DIV/0!"},0]
[166,"",{"$nulls":6},{"v":0,"d":"0%"},null,{"$error":"#REF!"},"",0,0,0,0,0,0,0,0,0,0,{"$f":"SUM(MID(J172,ROW(INDIRECT(\"h1:H\"&LEN(J172))),1)*1)","v":{"$error":"#REF!"}},{"$error":"#DIV/0!"},0]
[167,"",{"$nulls":6},{"v":0,"d":"0%"},null,{"$error":"#REF!"},"",0,0,0,0,0,0,0,0,0,0,{"$f":"SUM(MID(J173,ROW(INDIRECT(\"h1:H\"&LEN(J173))),1)*1)","v":{"$error":"#REF!"}},{"$error":"#DIV/0!"},0]
[168,"",{"$nulls":6},{"v":0,"d":"0%"},null,{"$error":"#REF!"},"",0,0,0,0,0,0,0,0,0,0,{"$f":"SUM(MID(J174,ROW(INDIRECT(\"h1:H\"&LEN(J174))),1)*1)","v":{"$error":"#REF!"}},{"$error":"#DIV/0!"},0]
[169,"",{"$nulls":6},{"v":0,"d":"0%"},null,{"$error":"#REF!"},"",0,0,0,0,0,0,0,0,0,0,{"$f":"SUM(MID(J175,ROW(INDIRECT(\"h1:H\"&LEN(J175))),1)*1)","v":{"$error":"#REF!"}},{"$error":"#DIV/0!"},0]
[170,"",{"$nulls":6},{"v":0,"d":"0%"},null,{"$error":"#REF!"},"",0,0,0,0,0,0,0,0,0,0,{"$f":"SUM(MID(J176,ROW(INDIRECT(\"h1:H\"&LEN(J176))),1)*1)","v":{"$error":"#REF!"}},{"$error":"#DIV/0!"},0]
[171,"",{"$nulls":6},{"v":0,"d":"0%"},null,{"$error":"#REF!"},"",0,0,0,0,0,0,0,0,0,0,{"$f":"SUM(MID(J177,ROW(INDIRECT(\"h1:H\"&LEN(J177))),1)*1)","v":{"$error":"#REF!"}},{"$error":"#DIV/0!"},0]
[172,"",{"$nulls":6},{"v":0,"d":"0%"},null,{"$error":"#REF!"},"",0,0,0,0,0,0,0,0,0,0,{"$f":"SUM(MID(J178,ROW(INDIRECT(\"h1:H\"&LEN(J178))),1)*1)","v":{"$error":"#REF!"}},{"$error":"#DIV/0!"},0]
[173,"",{"$nulls":6},{"v":0,"d":"0%"},null,{"$error":"#REF!"},"",0,0,0,0,0,0,0,0,0,0,{"$f":"SUM(MID(J179,ROW(INDIRECT(\"h1:H\"&LEN(J179))),1)*1)","v":{"$error":"#REF!"}},{"$error":"#DIV/0!"},0]
[174,"",{"$nulls":6},{"v":0,"d":"0%"},null,{"$error":"#REF!"},"",0,0,0,0,0,0,0,0,0,0,{"$f":"SUM(MID(J180,ROW(INDIRECT(\"h1:H\"&LEN(J180))),1)*1)","v":{"$error":"#REF!"}},{"$error":"#DIV/0!"},0]
[175,"",{"$nulls":6},{"v":0,"d":"0%"},null,{"$error":"#REF!"},"",0,0,0,0,0,0,0,0,0,0,{"$f":"SUM(MID(J181,ROW(INDIRECT(\"h1:H\"&LEN(J181))),1)*1)","v":{"$error":"#REF!"}},{"$error":"#DIV/0!"},0]
[176,{"$nulls":7},{"v":0,"d":"0%"},null,{"$error":"#REF!"},"",0,0,0,0,0,0,0,0,0,0,{"$f":"SUM(MID(J182,ROW(INDIRECT(\"h1:H\"&LEN(J182))),1)*1)","v":{"$error":"#REF!"}},{"$error":"#DIV/0!"},0]
[177,{"$nulls":7},{"v":0,"d":"0%"},null,{"$error":"#REF!"},"",0,0,0,0,0,0,0,0,0,0,{"$f":"SUM(MID(J183,ROW(INDIRECT(\"h1:H\"&LEN(J183))),1)*1)","v":{"$error":"#REF!"}},{"$error":"#DIV/0!"},0]
[178,{"$nulls":7},{"v":0,"d":"0%"},null,{"$error":"#REF!"},"",0,0,0,0,0,0,0,0,0,0,{"$f":"SUM(MID(J184,ROW(INDIRECT(\"h1:H\"&LEN(J184))),1)*1)","v":{"$error":"#REF!"}},{"$error":"#DIV/0!"},0]
[179,{"$nulls":7},{"v":0,"d":"0%"},null,{"$error":"#REF!"},"",0,0,0,0,0,0,0,0,0,0,{"$f":"SUM(MID(J185,ROW(INDIRECT(\"h1:H\"&LEN(J185))),1)*1)","v":{"$error":"#REF!"}},{"$error":"#DIV/0!"},0]
[180,{"$nulls":7},{"v":0,"d":"0%"},null,{"$error":"#REF!"},"",0,0,0,0,0,0,0,0,0,0,{"$f":"SUM(MID(J186,ROW(INDIRECT(\"h1:H\"&LEN(J186))),1)*1)","v":{"$error":"#REF!"}},{"$error":"#DIV/0!"},0]
[181,{"$nulls":7},{"v":0,"d":"0%"},null,{"$error":"#REF!"},"",0,0,0,0,0,0,0,0,0,0,{"$f":"SUM(MID(J187,ROW(INDIRECT(\"h1:H\"&LEN(J187))),1)*1)","v":{"$error":"#REF!"}},{"$error":"#DIV/0!"},0]
[182,{"$nulls":7},{"v":0,"d":"0%"},null,{"$error":"#REF!"},"",0,0,0,0,0,0,0,0,0,0,{"$f":"SUM(MID(J188,ROW(INDIRECT(\"h1:H\"&LEN(J188))),1)*1)","v":{"$error":"#REF!"}},{"$error":"#DIV/0!"},0]
[183,{"$nulls":7},{"v":0,"d":"0%"},null,{"$error":"#REF!"},"",0,0,0,0,0,0,0,0,0,0,{"$f":"SUM(MID(J189,ROW(INDIRECT(\"h1:H\"&LEN(J189))),1)*1)","v":{"$error":"#REF!"}},{"$error":"#DIV/0!"},0]
[184,{"$nulls":7},{"v":0,"d":"0%"},null,{"$error":"#REF!"},"",0,0,0,0,0,0,0,0,0,0,{"$f":"SUM(MID(J190,ROW(INDIRECT(\"h1:H\"&LEN(J190))),1)*1)","v":{"$error":"#REF!"}},{"$error":"#DIV/0!"},0]
[185,{"$nulls":7},{"v":0,"d":"0%"},null,{"$error":"#REF!"},"",0,0,0,0,0,0,0,0,0,0,{"$f":"SUM(MID(J191,ROW(INDIRECT(\"h1:H\"&LEN(J191))),1)*1)","v":{"$error":"#REF!"}},{"$error":"#DIV/0!"},0]
[186,{"$nulls":7},{"v":0,"d":"0%"},null,{"$error":"#REF!"},"",0,0,0,0,0,0,0,0,0,0,{"$f":"SUM(MID(J192,ROW(INDIRECT(\"h1:H\"&LEN(J192))),1)*1)","v":{"$error":"#REF!"}},{"$error":"#DIV/0!"},0]
[187,{"$nulls":7},{"v":0,"d":"0%"},null,{"$error":"#REF!"},"",0,0,{"$f":"M193-LEN(SUBSTITUTE(J193,\"1\",\"\"))+P193","v":0},0,0,0,0,0,0,0,{"$f":"SUM(MID(J193,ROW(INDIRECT(\"h1:H\"&LEN(J193))),1)*1)","v":{"$error":"#REF!"}},{"$error":"#DIV/0!"},0]
[188,{"$nulls":7},{"v":0,"d":"0%"},null,{"$error":"#REF!"},"",0,0,0,0,0,0,0,0,0,0,{"$f":"SUM(MID(J194,ROW(INDIRECT(\"h1:H\"&LEN(J194))),1)*1)","v":{"$error":"#REF!"}},{"$error":"#DIV/0!"},0]
[189,{"$nulls":7},{"v":0,"d":"0%"},null,{"$error":"#REF!"},"",0,0,0,0,0,0,0,0,0,0,{"$f":"SUM(MID(J195,ROW(INDIRECT(\"h1:H\"&LEN(J195))),1)*1)","v":{"$error":"#REF!"}},{"$error":"#DIV/0!"},0]
[190,{"$nulls":7},{"v":0,"d":"0%"},null,{"$error":"#REF!"},"",0,0,0,0,0,0,0,0,0,0,{"$f":"SUM(MID(J196,ROW(INDIRECT(\"h1:H\"&LEN(J196))),1)*1)","v":{"$error":"#REF!"}},{"$error":"#DIV/0!"},0]
[191,{"$nulls":7},{"v":0,"d":"0%"},null,{"$error":"#REF!"},"",0,0,0,0,0,0,0,0,0,0,{"$f":"SUM(MID(J197,ROW(INDIRECT(\"h1:H\"&LEN(J197))),1)*1)","v":{"$error":"#REF!"}},{"$error":"#DIV/0!"},0]
[192,{"$nulls":7},{"v":0,"d":"0%"},null,{"$error":"#REF!"},"",0,0,0,0,0,0,0,0,0,0,{"$f":"SUM(MID(J198,ROW(INDIRECT(\"h1:H\"&LEN(J198))),1)*1)","v":{"$error":"#REF!"}},{"$error":"#DIV/0!"},0]
[193,{"$nulls":7},{"v":0,"d":"0%"},null,{"$f":"IF(W199=E199,\"OK\",\"Falsch\")","v":{"$error":"#REF!"}},"",{"$f":"LEN(J199)","v":0},0,0,0,{"$f":"M199-LEN(SUBSTITUTE(J199,\"0\",\"\"))","v":0},{"$f":"I199*M199","v":0},0,{"$f":"M199-(M199-(LEN(J199)-LEN(SUBSTITUTE(J199,\"3\",\"\"))))+M199-(M199-(LEN(J199)-LEN(SUBSTITUTE(J199,\"5\",\"\"))))","v":0},0,{"$f":"M199-(M199-(LEN(J199)-LEN(SUBSTITUTE(J199,\"4\",\"\"))))+M199-(M199-(LEN(J199)-LEN(SUBSTITUTE(J199,\"5\",\"\"))))","v":0},{"$f":"SUM(MID(J199,ROW(INDIRECT(\"h1:H\"&LEN(J199))),1)*1)","v":{"$error":"#REF!"}},{"$error":"#DIV/0!"},0]
[194,{"$nulls":7},{"v":0,"d":"0%"},null,{"$error":"#REF!"},{"$f":"IF(H200=0,\"\",IF(M200=H200,\"OK\",\"Falsch\"))","v":""},0,{"$f":"M200-(M200-LEN(SUBSTITUTE(J200,\"0\",\"\")))-(M200-LEN(SUBSTITUTE(J200,\"1\",\"\")))-P200","v":0},0,{"$f":"IF($Z$7=\"J\",(M200-LEN(SUBSTITUTE(J200,\"42\",\"\")))/2+(M200-LEN(SUBSTITUTE(J200,\"222\",\"\")))/3,0)","v":0},0,0,{"$f":"ROUND(R200,0)","v":0},0,{"$f":"S200-T200","v":0},0,{"$f":"SUM(MID(J200,ROW(INDIRECT(\"h1:H\"&LEN(J200))),1)*1)","v":{"$error":"#REF!"}},{"$f":"F200/D200","v":{"$error":"#DIV/0!"}},{"$f":"F200-D200","v":0}]
[195,{"$nulls":7},{"v":0,"d":"0%"},null,{"$error":"#REF!"},"",0,0,0,0,0,0,0,0,0,0,{"$f":"SUM(MID(J201,ROW(INDIRECT(\"h1:H\"&LEN(J201))),1)*1)","v":{"$error":"#REF!"}},{"$error":"#DIV/0!"},0]
[196,{"$nulls":7},{"v":0,"d":"0%"},null,{"$error":"#REF!"},"",0,0,0,0,0,0,0,0,0,0,{"$f":"SUM(MID(J202,ROW(INDIRECT(\"h1:H\"&LEN(J202))),1)*1)","v":{"$error":"#REF!"}},{"$error":"#DIV/0!"},0]
[197,{"$nulls":7},{"v":0,"d":"0%"},null,{"$error":"#REF!"},"",0,0,0,0,0,0,0,0,0,0,{"$f":"SUM(MID(J203,ROW(INDIRECT(\"h1:H\"&LEN(J203))),1)*1)","v":{"$error":"#REF!"}},{"$error":"#DIV/0!"},0]
[198,{"$nulls":7},{"v":0,"d":"0%"},null,{"$error":"#REF!"},"",0,0,0,0,0,0,0,0,0,0,{"$f":"SUM(MID(J204,ROW(INDIRECT(\"h1:H\"&LEN(J204))),1)*1)","v":{"$error":"#REF!"}},{"$error":"#DIV/0!"},0]
[199,{"$nulls":7},{"v":0,"d":"0%"},null,{"$error":"#REF!"},"",0,0,0,0,0,0,0,0,0,0,{"$f":"SUM(MID(J205,ROW(INDIRECT(\"h1:H\"&LEN(J205))),1)*1)","v":{"$error":"#REF!"}},{"$error":"#DIV/0!"},0]
[200,{"$nulls":7},{"v":0,"d":"0%"},null,{"$error":"#REF!"},"",0,0,0,0,0,0,0,0,0,0,{"$f":"SUM(MID(J206,ROW(INDIRECT(\"h1:H\"&LEN(J206))),1)*1)","v":{"$error":"#REF!"}},{"$error":"#DIV/0!"},0]

{"sheet":"2022-11-29-STB-L2","index":2,"n_rows":206,"n_cols":26,"rows_kept":206}
["Turnier:",null,"https://lichess.org/tournament/jvba3MnW"]
["Datum:",null,"2022-11-29"]
["Bed.Zeit:",null,"3/2"]
["Berserker:",null,"J","(J/N)"]
["Arenastr:",null,"N","(J/N)"]
["Rang","Titel","Benutzername","Elo","Pkt.","Perf.","Team","Anzahl\nPartien","Bers.\n%","Partien Resultate","Check\nPunkte","Check\nAnzahl\nPartien","Part.","Win","Remis","Arena\nRemis","Lose","Total Berserker","Tot.\nBers.","Bers.\nWin","Bers.\nRemis\n Lose","Arena\nStrikes","Pkt.","Faktor\nPerformance\ngeteilt durch\nElozahl","Elo Zuwachs\nPerformance\nminus Elozahl"]
[1,"","Buats",2276,29,2261,"court",17,{"v":0.65,"d":"65%"},"00332032231203302",{"$f":"IF(W7=E7,\"OK\",\"Falsch\")","v":"OK"},{"$f":"IF(H7=0,\"\",IF(M7=H7,\"OK\",\"Falsch\"))","v":"OK"},{"$f":"LEN(J7)","v":17},{"$f":"M7-(M7-LEN(SUBSTITUTE(J7,\"0\",\"\")))-(M7-LEN(SUBSTITUTE(J7,\"1\",\"\")))-P7","v":11},{"$f":"M7-LEN(SUBSTITUTE(J7,\"1\",\"\"))+P7","v":1},{"$f":"IF($Z$7=\"J\",(M7-LEN(SUBSTITUTE(J7,\"42\",\"\")))/2+(M7-LEN(SUBSTITUTE(J7,\"222\",\"\")))/3,0)","v":0},{"$f":"M7-LEN(SUBSTITUTE(J7,\"0\",\"\"))","v":5},{"$f":"I7*M7","v":{"v":11.05,"d":"11"}},{"$f":"ROUND(R7,0)","v":11},{"$f":"M7-(M7-(LEN(J7)-LEN(SUBSTITUTE(J7,\"3\",\"\"))))+M7-(M7-(LEN(J7)-LEN(SUBSTITUTE(J7,\"5\",\"\"))))","v":6},{"$f":"S7-T7","v":5},{"$f":"M7-(M7-(LEN(J7)-LEN(SUBSTITUTE(J7,\"4\",\"\"))))+M7-(M7-(LEN(J7)-LEN(SUBSTITUTE(J7,\"5\",\"\"))))","v":0},{"$f":"SUM(MID(J7,ROW(INDIRECT(\"h1:H\"&LEN(J7))),1)*1)","v":29},{"$f":"F7/D7","v":{"v":0.9934094903339191,"d":"0.99"}},{"$f":"F7-D7","v":{"v":-15,"d":"-15 "}},{"$f":"C5","v":"N"}]
[2,"","Gabriel4irmaos",2244,28,2234,"court",17,{"v":0.18,"d":"18%"},"00320210223223222","OK",{"$f":"IF(H8=0,\"\",IF(M8=H8,\"OK\",\"Falsch\"))","v":"OK"},17,{"$f":"M8-(M8-LEN(SUBSTITUTE(J8,\"0\",\"\")))-(M8-LEN(SUBSTITUTE(J8,\"1\",\"\")))-P8","v":12},1,{"$f":"IF($Z$7=\"J\",(M8-LEN(SUBSTITUTE(J8,\"42\",\"\")))/2+(M8-LEN(SUBSTITUTE(J8,\"222\",\"\")))/3,0)","v":0},4,{"v":3.06,"d":"3"},{"$f":"ROUND(R8,0)","v":3},3,{"$f":"S8-T8","v":0},0,{"$f":"SUM(MID(J8,ROW(INDIRECT(\"h1:H\"&LEN(J8))),1)*1)","v":28},{"$f":"F8/D8","v":{"v":0.9955436720142602,"d":"1.00"}},{"$f":"F8-D8","v":{"v":-10,"d":"-10 "}}]
[3,"","chessplayer_007",2268,26,2463,"baarer-free-pawns-1",16,{"v":0,"d":"0%"},"2222222221220210","OK","OK",16,12,2,0,2,0,0,0,0,0,{"$f":"SUM(MID(J9,ROW(INDIRECT(\"h1:H\"&LEN(J9))),1)*1)","v":26},{"v":1.085978835978836,"d":"1.09"},195]
[4,"","FrankPoole",2408,26,2317,"sv-wollishofen",16,{"v":0,"d":"0%"},"2202022222022222","OK","OK",16,13,0,0,3,0,0,0,0,0,{"$f":"SUM(MID(J10,ROW(INDIRECT(\"h1:H\"&LEN(J10))),1)*1)","v":26},{"v":0.9622093023255814,"d":"0.96"},{"v":-91,"d":"-91 "}]
[5,"","Mi1964",2352,25,2435,"sprengschach",14,{"v":0,"d":"0%"},"22222212122122","OK","OK",14,11,3,0,0,0,0,0,0,0,{"$f":"SUM(MID(J11,ROW(INDIRECT(\"h1:H\"&LEN(J11))),1)*1)","v":25},{"v":1.0352891156462585,"d":"1.04"},83]
[6,"","Baeron-7",2145,21,2209,"sv-wollishofen",15,{"v":0.13,"d":"13%"},"221102230220220","OK","OK",15,9,2,0,4,{"v":1.9500000000000002,"d":"2"},2,1,1,0,{"$f":"SUM(MID(J12,ROW(INDIRECT(\"h1:H\"&LEN(J12))),1)*1)","v":21},{"v":1.02983682983683,"d":"1.03"},64]
[7,"","ManuelSprenger",2185,20,2113,"sprengschach",16,{"v":0.25,"d":"25%"},"2032022102202002","OK","OK",16,9,1,0,6,4,4,1,3,0,{"$f":"SUM(MID(J13,ROW(INDIRECT(\"h1:H\"&LEN(J13))),1)*1)","v":20},{"v":0.9670480549199084,"d":"0.97"},{"v":-72,"d":"-72 "}]
[8,"","waits1960",2133,19,2130,"schweizer-schach-senioren",17,{"v":0,"d":"0%"},"22120020200202022","OK","OK",17,9,1,0,7,0,0,0,0,0,{"$f":"SUM(MID(J14,ROW(INDIRECT(\"h1:H\"&LEN(J14))),1)*1)","v":19},{"v":0.9985935302390999,"d":"1.00"},{"v":-3,"d":"-3 "}]
[9,"","puppeli",2263,18,2067,"schweizer-schach-senioren",11,{"v":0.09,"d":"9%"},"02222213202","OK","OK",11,8,1,0,2,{"v":0.99,"d":"1"},1,1,0,0,{"$f":"SUM(MID(J15,ROW(INDIRECT(\"h1:H\"&LEN(J15))),1)*1)","v":18},{"v":0.9133893062306673,"d":"0.91"},{"v":-196,"d":"-196 "}]
[10,"","Patmaster12",1935,18,1906,"sg-baden",17,{"v":0.18,"d":"18%"},"22002100200230301","OK","OK",17,7,2,0,8,{"v":3.06,"d":"3"},3,2,1,0,{"$f":"SUM(MID(J16,ROW(INDIRECT(\"h1:H\"&LEN(J16))),1)*1)","v":18},{"v":0.9850129198966409,"d":"0.99"},{"v":-29,"d":"-29 "}]
[11,"","Amateurmeister",2297,17,2209,"solothurn-krumm-turm",13,{"v":0,"d":"0%"},"2022022022201","OK","OK",13,8,1,0,4,0,0,0,0,0,{"$f":"SUM(MID(J17,ROW(INDIRECT(\"h1:H\"&LEN(J17))),1)*1)","v":17},{"v":0.9616891597736178,"d":"0.96"},{"v":-88,"d":"-88 "}]
[12,"","tooldtoimprove",2172,16,2206,"schweizer-schach-senioren",11,{"v":0,"d":"0%"},"02222222200","OK","OK",11,8,0,0,3,0,0,0,0,0,{"$f":"SUM(MID(J18,ROW(INDIRECT(\"h1:H\"&LEN(J18))),1)*1)","v":16},{"v":1.0156537753222836,"d":"1.02"},34]
[13,"","teka06",2172,16,2154,"sv-wollishofen",11,{"v":0,"d":"0%"},"20202202222","OK","OK",11,8,0,0,3,0,0,0,0,0,{"$f":"SUM(MID(J19,ROW(INDIRECT(\"h1:H\"&LEN(J19))),1)*1)","v":16},{"v":0.9917127071823204,"d":"0.99"},{"v":-18,"d":"-18 "}]
[14,"","Andrey-SP",2290,16,1989,"ladja",14,{"v":0.21,"d":"21%"},"03300202201030","OK","OK",14,6,1,0,7,{"v":2.94,"d":"3"},3,3,0,0,{"$f":"SUM(MID(J20,ROW(INDIRECT(\"h1:H\"&LEN(J20))),1)*1)","v":16},{"v":0.8685589519650655,"d":"0.87"},{"v":-301,"d":"-301 "}]
[15,"","chessi1966",2142,15,2300,"sprengschach",7,{"v":0.14,"d":"14%"},"2222322","OK","OK",7,7,0,0,0,{"v":0.9800000000000001,"d":"1"},1,1,0,0,{"$f":"SUM(MID(J21,ROW(INDIRECT(\"h1:H\"&LEN(J21))),1)*1)","v":15},{"v":1.0737628384687208,"d":"1.07"},158]
[16,"","Timm74",1834,15,2055,"schachklub-biel",15,{"v":0,"d":"0%"},"022200200122020","OK","OK",15,7,1,0,7,0,0,0,0,0,{"$f":"SUM(MID(J22,ROW(INDIRECT(\"h1:H\"&LEN(J22))),1)*1)","v":15},{"v":1.1205016357688113,"d":"1.12"},221]
[17,"","G627082",1995,14,1988,"court",12,{"v":0,"d":"0%"},"221012220020","OK","OK",12,6,2,0,4,0,0,0,0,0,{"$f":"SUM(MID(J23,ROW(INDIRECT(\"h1:H\"&LEN(J23))),1)*1)","v":14},{"v":0.9964912280701754,"d":"1.00"},{"v":-7,"d":"-7 "}]
[18,"","Brettmitte",1814,14,1920,"sg-baden",12,{"v":0,"d":"0%"},"221200021022","OK","OK",12,6,2,0,4,0,0,0,0,0,{"$f":"SUM(MID(J24,ROW(INDIRECT(\"h1:H\"&LEN(J24))),1)*1)","v":14},{"v":1.0584343991179714,"d":"1.06"},106]
[19,"","mtaphy",1801,13,1962,"ladja",11,{"v":0.09,"d":"9%"},"22010301202","OK","OK",11,5,2,0,4,{"v":0.99,"d":"1"},1,1,0,0,{"$f":"SUM(MID(J25,ROW(INDIRECT(\"h1:H\"&LEN(J25))),1)*1)","v":13},{"v":1.0893947806774014,"d":"1.09"},161]
[20,"","KenHar7",1738,13,1850,"court",14,{"v":0,"d":"0%"},"10202200220002","OK","OK",14,6,1,0,7,0,0,0,0,0,{"$f":"SUM(MID(J26,ROW(INDIRECT(\"h1:H\"&LEN(J26))),1)*1)","v":13},{"v":1.0644418872266974,"d":"1.06"},112]
[21,"","E5F4",1734,13,1721,"ladja",14,{"v":0,"d":"0%"},"20200202010202","OK","OK",14,6,1,0,7,0,0,0,0,0,{"$f":"SUM(MID(J27,ROW(INDIRECT(\"h1:H\"&LEN(J27))),1)*1)","v":13},{"v":0.9925028835063437,"d":"0.99"},{"v":-13,"d":"-13 "}]
[22,"","gkra",1996,12,1953,"sv-wollishofen",12,{"v":0,"d":"0%"},"200120220012","OK","OK",12,5,2,0,5,0,0,0,0,0,{"$f":"SUM(MID(J28,ROW(INDIRECT(\"h1:H\"&LEN(J28))),1)*1)","v":12},{"v":0.9784569138276553,"d":"0.98"},{"v":-43,"d":"-43 "}]
[23,"","SelomIII",1927,12,1872,"sg-baden",12,{"v":0,"d":"0%"},"211102202001","OK","OK",12,4,4,0,4,0,0,0,0,0,{"$f":"SUM(MID(J29,ROW(INDIRECT(\"h1:H\"&LEN(J29))),1)*1)","v":12},{"v":0.97145822522055,"d":"0.97"},{"v":-55,"d":"-55 "}]
[24,"","MG60",1911,12,1867,"sv-wollishofen",10,{"v":0,"d":"0%"},"0222022020","OK","OK",10,6,0,0,4,0,0,0,0,0,{"$f":"SUM(MID(J30,ROW(INDIRECT(\"h1:H\"&LEN(J30))),1)*1)","v":12},{"v":0.9769754055468342,"d":"0.98"},{"v":-44,"d":"-44 "}]
[25,"","LexxaK",2135,11,2102,"ladja",8,{"v":0,"d":"0%"},"22022201","OK","OK",8,5,1,0,2,0,0,0,0,0,{"$f":"SUM(MID(J31,ROW(INDIRECT(\"h1:H\"&LEN(J31))),1)*1)","v":11},{"v":0.9845433255269321,"d":"0.98"},{"v":-33,"d":"-33 "}]
[26,"","Hoefipower",2013,11,2007,"sk-rapperswil-jona",12,{"v":0,"d":"0%"},"221012021000","OK","OK",12,4,3,0,5,0,0,0,0,0,{"$f":"SUM(MID(J32,ROW(INDIRECT(\"h1:H\"&LEN(J32))),1)*1)","v":11},{"v":0.9970193740685543,"d":"1.00"},{"v":-6,"d":"-6 "}]
[27,"","UM-AmsterDam",1970,11,1866,"baarer-free-pawns-1",11,{"v":0,"d":"0%"},"02122020002","OK","OK",11,5,1,0,5,0,0,0,0,0,{"$f":"SUM(MID(J33,ROW(INDIRECT(\"h1:H\"&LEN(J33))),1)*1)","v":11},{"v":0.9472081218274112,"d":"0.95"},{"v":-104,"d":"-104 "}]
[28,"","Goldinus",1857,11,1854,"sk-rapperswil-jona",10,{"v":0,"d":"0%"},"2001202202","OK","OK",10,5,1,0,4,0,0,0,0,0,{"$f":"SUM(MID(J34,ROW(INDIRECT(\"h1:H\"&LEN(J34))),1)*1)","v":11},{"v":0.9983844911147012,"d":"1.00"},{"v":-3,"d":"-3 "}]
[29,"","Lutz-aus-M",2076,10,1934,"schweizer-schach-senioren",8,{"v":0,"d":"0%"},"02022220","OK","OK",8,5,0,0,3,0,0,0,0,0,{"$f":"SUM(MID(J35,ROW(INDIRECT(\"h1:H\"&LEN(J35))),1)*1)","v":10},{"v":0.9315992292870906,"d":"0.93"},{"v":-142,"d":"-142 "}]
[30,"","Jourefrmg",1889,10,1781,"schweizer-schach-senioren",12,{"v":0,"d":"0%"},"002022002020","OK","OK",12,5,0,0,7,0,0,0,0,0,{"$f":"SUM(MID(J36,ROW(INDIRECT(\"h1:H\"&LEN(J36))),1)*1)","v":10},{"v":0.9428268925357332,"d":"0.94"},{"v":-108,"d":"-108 "}]
[31,"","Tobyes",1970,10,1724,"baarer-free-pawns-1",12,{"v":0,"d":"0%"},"020200022020","OK","OK",12,5,0,0,7,0,0,0,0,0,{"$f":"SUM(MID(J37,ROW(INDIRECT(\"h1:H\"&LEN(J37))),1)*1)","v":10},{"v":0.8751269035532995,"d":"0.88"},{"v":-246,"d":"-246 "}]
[32,"","beardedcollie",1595,10,1715,"schweizer-schach-senioren",12,{"v":0,"d":"0%"},"200200022020","OK","OK",12,5,0,0,7,0,0,0,0,0,{"$f":"SUM(MID(J38,ROW(INDIRECT(\"h1:H\"&LEN(J38))),1)*1)","v":10},{"v":1.0752351097178683,"d":"1.08"},120]
[33,"","KxKh9",1898,10,1654,"sprengschach",7,{"v":0.57,"d":"57%"},"0330013","OK","OK",7,3,1,0,3,{"v":3.9899999999999998,"d":"4"},4,3,1,0,{"$f":"SUM(MID(J39,ROW(INDIRECT(\"h1:H\"&LEN(J39))),1)*1)","v":10},{"v":0.8714436248682824,"d":"0.87"},{"v":-244,"d":"-244 "}]
[34,"","jean34",1569,9,1707,"schweizer-schach-senioren",12,{"v":0,"d":"0%"},"200022001002","OK","OK",12,4,1,0,7,0,0,0,0,0,{"$f":"SUM(MID(J40,ROW(INDIRECT(\"h1:H\"&LEN(J40))),1)*1)","v":9},{"v":1.0879541108986617,"d":"1.09"},138]
[35,"","igor_yasakov",2138,8,1886,"ladja",6,{"v":0,"d":"0%"},"002222","OK","OK",6,4,0,0,2,0,0,0,0,0,{"$f":"SUM(MID(J41,ROW(INDIRECT(\"h1:H\"&LEN(J41))),1)*1)","v":8},{"v":0.882132834424696,"d":"0.88"},{"v":-252,"d":"-252 "}]
[36,"","Zueblianer",1865,8,1826,"sk-rapperswil-jona",7,{"v":0,"d":"0%"},"2211002","OK","OK",7,3,2,0,2,0,0,0,0,0,{"$f":"SUM(MID(J42,ROW(INDIRECT(\"h1:H\"&LEN(J42))),1)*1)","v":8},{"v":0.9790884718498659,"d":"0.98"},{"v":-39,"d":"-39 "}]
[37,"","LG3000",1835,8,1760,"court",5,{"v":0,"d":"0%"},"20222","OK","OK",5,4,0,0,1,0,0,0,0,0,{"$f":"SUM(MID(J43,ROW(INDIRECT(\"h1:H\"&LEN(J43))),1)*1)","v":8},{"v":0.9591280653950953,"d":"0.96"},{"v":-75,"d":"-75 "}]
[38,"","agim_1977",1701,8,1645,"sprengschach",9,{"v":0,"d":"0%"},"201021200","OK","OK",9,3,2,0,4,0,0,0,0,0,{"$f":"SUM(MID(J44,ROW(INDIRECT(\"h1:H\"&LEN(J44))),1)*1)","v":8},{"v":0.9670781893004116,"d":"0.97"},{"v":-56,"d":"-56 "}]
[39,"","paluehm",1551,8,1638,"sg-baden",14,{"v":0,"d":"0%"},"00021012200000","OK","OK",14,3,2,0,9,0,0,0,0,0,{"$f":"SUM(MID(J45,ROW(INDIRECT(\"h1:H\"&LEN(J45))),1)*1)","v":8},{"v":1.056092843326886,"d":"1.06"},87]
[40,"","Tomsker",1718,8,1635,"solothurn-krumm-turm",9,{"v":0,"d":"0%"},"001221002","OK","OK",9,3,2,0,4,0,0,0,0,0,{"$f":"SUM(MID(J46,ROW(INDIRECT(\"h1:H\"&LEN(J46))),1)*1)","v":8},{"v":0.9516880093131548,"d":"0.95"},{"v":-83,"d":"-83 "}]
[41,"","Remo_the_iron_rook",1678,8,1606,"sg-baden",14,{"v":0,"d":"0%"},"00020200200002","OK","OK",14,4,0,0,10,0,0,0,0,0,{"$f":"SUM(MID(J47,ROW(INDIRECT(\"h1:H\"&LEN(J47))),1)*1)","v":8},{"v":0.9570917759237187,"d":"0.96"},{"v":-72,"d":"-72 "}]
[42,"","Michal_Arend",1729,8,1604,"schweizer-schach-senioren",11,{"v":0,"d":"0%"},"10002120002","OK","OK",11,3,2,0,6,0,0,0,0,0,{"$f":"SUM(MID(J48,ROW(INDIRECT(\"h1:H\"&LEN(J48))),1)*1)","v":8},{"v":0.9277038750722961,"d":"0.93"},{"v":-125,"d":"-125 "}]
[43,"","macrofaell",1850,8,1500,"sg-baden",6,{"v":0,"d":"0%"},"202022","OK","OK",6,4,0,0,2,0,0,0,0,0,{"$f":"SUM(MID(J49,ROW(INDIRECT(\"h1:H\"&LEN(J49))),1)*1)","v":8},{"v":0.8108108108108109,"d":"0.81"},{"v":-350,"d":"-350 "}]
[44,"","Igor_33",1755,8,1394,"baarer-free-pawns-1",15,{"v":0.6,"d":"60%"},"000100000000313","OK","OK",15,2,2,0,11,9,9,2,7,0,{"$f":"SUM(MID(J50,ROW(INDIRECT(\"h1:H\"&LEN(J50))),1)*1)","v":8},{"v":0.7943019943019943,"d":"0.79"},{"v":-361,"d":"-361 "}]
[45,"","KneZ1956",1618,7,1692,"ladja",7,{"v":0,"d":"0%"},"2100202","OK","OK",7,3,1,0,3,0,0,0,0,0,{"$f":"SUM(MID(J51,ROW(INDIRECT(\"h1:H\"&LEN(J51))),1)*1)","v":7},{"v":1.045735475896168,"d":"1.05"},74]
[46,"","SaBuRJ",1800,6,1953,"sk-rapperswil-jona",5,{"v":0,"d":"0%"},"22020","OK","OK",5,3,0,0,2,0,0,0,0,0,{"$f":"SUM(MID(J52,ROW(INDIRECT(\"h1:H\"&LEN(J52))),1)*1)","v":6},{"v":1.085,"d":"1.09"},153]
[47,"","Damenzug",1359,6,1651,"schachklub-biel",11,{"v":0,"d":"0%"},"00002002020","OK","OK",11,3,0,0,8,0,0,0,0,0,{"$f":"SUM(MID(J53,ROW(INDIRECT(\"h1:H\"&LEN(J53))),1)*1)","v":6},{"v":1.2148638704930095,"d":"1.21"},292]
[48,"","dumDudum",2026,5,1760,"sprengschach",3,{"v":0.33,"d":"33%"},"203","OK","OK",3,2,0,0,1,{"v":0.99,"d":"1"},1,1,0,0,{"$f":"SUM(MID(J54,ROW(INDIRECT(\"h1:H\"&LEN(J54))),1)*1)","v":5},{"v":0.8687068114511353,"d":"0.87"},{"v":-266,"d":"-266 "}]
[49,"","jordinitx",1581,5,1610,"schachklub-biel",13,{"v":0,"d":"0%"},"0010100210000","OK","OK",13,1,3,0,9,0,0,0,0,0,{"$f":"SUM(MID(J55,ROW(INDIRECT(\"h1:H\"&LEN(J55))),1)*1)","v":5},{"v":1.0183428209993675,"d":"1.02"},29]
[50,"","mortimer22",1472,5,1470,"solothurn-krumm-turm",8,{"v":0,"d":"0%"},"10200200","OK","OK",8,2,1,0,5,0,0,0,0,0,{"$f":"SUM(MID(J56,ROW(INDIRECT(\"h1:H\"&LEN(J56))),1)*1)","v":5},{"v":0.998641304347826,"d":"1.00"},{"v":-2,"d":"-2 "}]
[51,"","kap196",1650,4,1756,"ladja",5,{"v":0,"d":"0%"},"20200","OK","OK",5,2,0,0,3,0,0,0,0,0,{"$f":"SUM(MID(J57,ROW(INDIRECT(\"h1:H\"&LEN(J57))),1)*1)","v":4},{"v":1.0642424242424242,"d":"1.06"},106]
[52,"","Dinou10",1627,4,1605,"court",7,{"v":0,"d":"0%"},"2200000","OK","OK",7,2,0,0,5,0,0,0,0,0,{"$f":"SUM(MID(J58,ROW(INDIRECT(\"h1:H\"&LEN(J58))),1)*1)","v":4},{"v":0.986478180700676,"d":"0.99"},{"v":-22,"d":"-22 "}]
[53,"","Kofirhei",1739,4,1584,"sv-wollishofen",7,{"v":0,"d":"0%"},"0220000","OK","OK",7,2,0,0,5,0,0,0,0,0,{"$f":"SUM(MID(J59,ROW(INDIRECT(\"h1:H\"&LEN(J59))),1)*1)","v":4},{"v":0.9108683151236343,"d":"0.91"},{"v":-155,"d":"-155 "}]
[54,"","KombiMonster",1190,3,1421,"schachklub-biel",14,{"v":0,"d":"0%"},"02100000000000","OK","OK",14,1,1,0,12,0,0,0,0,0,{"$f":"SUM(MID(J60,ROW(INDIRECT(\"h1:H\"&LEN(J60))),1)*1)","v":3},{"v":1.1941176470588235,"d":"1.19"},231]
[55,"","Chessspiderman",1380,2,1460,"solothurn-krumm-turm",2,{"v":0,"d":"0%"},"20","OK","OK",2,1,0,0,1,0,0,0,0,0,{"$f":"SUM(MID(J61,ROW(INDIRECT(\"h1:H\"&LEN(J61))),1)*1)","v":2},{"v":1.0579710144927537,"d":"1.06"},80]
[56,"","Hene47",1129,2,1378,"schachklub-biel",12,{"v":0,"d":"0%"},"020000000000","OK","OK",12,1,0,0,11,0,0,0,0,0,{"$f":"SUM(MID(J62,ROW(INDIRECT(\"h1:H\"&LEN(J62))),1)*1)","v":2},{"v":1.220549158547387,"d":"1.22"},249]
[57,"","beno33",1244,1,1369,"schachklub-biel",14,{"v":0,"d":"0%"},"00001000000000","OK","OK",14,0,1,0,13,0,0,0,0,0,{"$f":"SUM(MID(J63,ROW(INDIRECT(\"h1:H\"&LEN(J63))),1)*1)","v":1},{"v":1.1004823151125402,"d":"1.10"},125]
[58,"","meisterpa",1204,1,1347,"schachklub-biel",14,{"v":0,"d":"0%"},"00010000000000","OK","OK",14,0,1,0,13,0,0,0,0,0,{"$f":"SUM(MID(J64,ROW(INDIRECT(\"h1:H\"&LEN(J64))),1)*1)","v":1},{"v":1.1187707641196014,"d":"1.12"},143]
[{"$nulls":10},{"$error":"#REF!"},"",0,0,0,0,0,0,0,0,0,0,{"$f":"SUM(MID(J65,ROW(INDIRECT(\"h1:H\"&LEN(J65))),1)*1)","v":{"$error":"#REF!"}},{"$error":"#DIV/0!"},0]
[{"$nulls":10},{"$error":"#REF!"},"",0,0,0,0,0,0,0,0,0,0,{"$f":"SUM(MID(J66,ROW(INDIRECT(\"h1:H\"&LEN(J66))),1)*1)","v":{"$error":"#REF!"}},{"$error":"#DIV/0!"},0]
[{"$nulls":8},{"v":0,"d":"0%"},null,{"$error":"#REF!"},"",0,0,0,0,0,0,0,0,0,0,{"$f":"SUM(MID(J67,ROW(INDIRECT(\"h1:H\"&LEN(J67))),1)*1)","v":{"$error":"#REF!"}},{"$error":"#DIV/0!"},0]
[{"$nulls":8},{"v":0,"d":"0%"},null,{"$error":"#REF!"},"",0,0,0,0,0,0,0,0,0,0,{"$f":"SUM(MID(J68,ROW(INDIRECT(\"h1:H\"&LEN(J68))),1)*1)","v":{"$error":"#REF!"}},{"$error":"#DIV/0!"},0]
[{"$nulls":8},{"v":0,"d":"0%"},null,{"$error":"#REF!"},"",0,0,0,0,0,0,0,0,0,0,{"$f":"SUM(MID(J69,ROW(INDIRECT(\"h1:H\"&LEN(J69))),1)*1)","v":{"$error":"#REF!"}},{"$error":"#DIV/0!"},0]
[{"$nulls":8},{"v":0,"d":"0%"},null,{"$error":"#REF!"},"",0,0,0,0,0,0,0,0,0,0,{"$f":"SUM(MID(J70,ROW(INDIRECT(\"h1:H\"&LEN(J70))),1)*1)","v":{"$error":"#REF!"}},{"$error":"#DIV/0!"},0]
[{"$nulls":8},{"v":0,"d":"0%"},null,{"$f":"IF(W71=E71,\"OK\",\"Falsch\")","v":{"$error":"#REF!"}},"",{"$f":"LEN(J71)","v":0},0,{"$f":"M71-LEN(SUBSTITUTE(J71,\"1\",\"\"))+P71","v":0},0,{"$f":"M71-LEN(SUBSTITUTE(J71,\"0\",\"\"))","v":0},{"$f":"I71*M71","v":0},0,{"$f":"M71-(M71-(LEN(J71)-LEN(SUBSTITUTE(J71,\"3\",\"\"))))+M71-(M71-(LEN(J71)-LEN(SUBSTITUTE(J71,\"5\",\"\"))))","v":0},0,{"$f":"M71-(M71-(LEN(J71)-LEN(SUBSTITUTE(J71,\"4\",\"\"))))+M71-(M71-(LEN(J71)-LEN(SUBSTITUTE(J71,\"5\",\"\"))))","v":0},{"$f":"SUM(MID(J71,ROW(INDIRECT(\"h1:H\"&LEN(J71))),1)*1)","v":{"$error":"#REF!"}},{"$error":"#DIV/0!"},0]
[{"$nulls":8},{"v":0,"d":"0%"},null,{"$error":"#REF!"},{"$f":"IF(H72=0,\"\",IF(M72=H72,\"OK\",\"Falsch\"))","v":""},0,{"$f":"M72-(M72-LEN(SUBSTITUTE(J72,\"0\",\"\")))-(M72-LEN(SUBSTITUTE(J72,\"1\",\"\")))-P72","v":0},0,{"$f":"IF($Z$7=\"J\",(M72-LEN(SUBSTITUTE(J72,\"42\",\"\")))/2+(M72-LEN(SUBSTITUTE(J72,\"222\",\"\")))/3,0)","v":0},0,0,{"$f":"ROUND(R72,0)","v":0},0,{"$f":"S72-T72","v":0},0,{"$f":"SUM(MID(J72,ROW(INDIRECT(\"h1:H\"&LEN(J72))),1)*1)","v":{"$error":"#REF!"}},{"$f":"F72/D72","v":{"$error":"#DIV/0!"}},{"$f":"F72-D72","v":0}]
[{"$nulls":8},{"v":0,"d":"0%"},null,{"$error":"#REF!"},"",0,0,0,0,0,0,0,0,0,0,{"$f":"SUM(MID(J73,ROW(INDIRECT(\"h1:H\"&LEN(J73))),1)*1)","v":{"$error":"#REF!"}},{"$error":"#DIV/0!"},0]
[{"$nulls":8},{"v":0,"d":"0%"},null,{"$error":"#REF!"},"",0,0,0,0,0,0,0,0,0,0,{"$f":"SUM(MID(J74,ROW(INDIRECT(\"h1:H\"&LEN(J74))),1)*1)","v":{"$error":"#REF!"}},{"$error":"#DIV/0!"},0]
[{"$nulls":8},{"v":0,"d":"0%"},null,{"$error":"#REF!"},"",0,0,0,0,0,0,0,0,0,0,{"$f":"SUM(MID(J75,ROW(INDIRECT(\"h1:H\"&LEN(J75))),1)*1)","v":{"$error":"#REF!"}},{"$error":"#DIV/0!"},0]
[{"$nulls":8},{"v":0,"d":"0%"},null,{"$error":"#REF!"},"",0,0,0,0,0,0,0,0,0,0,{"$f":"SUM(MID(J76,ROW(INDIRECT(\"h1:H\"&LEN(J76))),1)*1)","v":{"$error":"#REF!"}},{"$error":"#DIV/0!"},0]
[{"$nulls":8},{"v":0,"d":"0%"},null,{"$error":"#REF!"},"",0,0,0,0,0,0,0,0,0,0,{"$f":"SUM(MID(J77,ROW(INDIRECT(\"h1:H\"&LEN(J77))),1)*1)","v":{"$error":"#REF!"}},{"$error":"#DIV/0!"},0]
[{"$nulls":8},{"v":0,"d":"0%"},null,{"$error":"#REF!"},"",0,0,0,0,0,0,0,0,0,0,{"$f":"SUM(MID(J78,ROW(INDIRECT(\"h1:H\"&LEN(J78))),1)*1)","v":{"$error":"#REF!"}},{"$error":"#DIV/0!"},0]
[{"$nulls":8},{"v":0,"d":"0%"},null,{"$error":"#REF!"},"",0,0,0,0,0,0,0,0,0,0,{"$f":"SUM(MID(J79,ROW(INDIRECT(\"h1:H\"&LEN(J79))),1)*1)","v":{"$error":"#REF!"}},{"$error":"#DIV/0!"},0]
[{"$nulls":8},{"v":0,"d":"0%"},null,{"$error":"#REF!"},"",0,0,0,0,0,0,0,0,0,0,{"$f":"SUM(MID(J80,ROW(INDIRECT(\"h1:H\"&LEN(J80))),1)*1)","v":{"$error":"#REF!"}},{"$error":"#DIV/0!"},0]
[{"$nulls":8},{"v":0,"d":"0%"},null,{"$error":"#REF!"},"",0,0,0,0,0,0,0,0,0,0,{"$f":"SUM(MID(J81,ROW(INDIRECT(\"h1:H\"&LEN(J81))),1)*1)","v":{"$error":"#REF!"}},{"$error":"#DIV/0!"},0]
[{"$nulls":8},{"v":0,"d":"0%"},null,{"$error":"#REF!"},"",0,0,0,0,0,0,0,0,0,0,{"$f":"SUM(MID(J82,ROW(INDIRECT(\"h1:H\"&LEN(J82))),1)*1)","v":{"$error":"#REF!"}},{"$error":"#DIV/0!"},0]
[{"$nulls":8},{"v":0,"d":"0%"},null,{"$error":"#REF!"},"",0,0,0,0,0,0,0,0,0,0,{"$f":"SUM(MID(J83,ROW(INDIRECT(\"h1:H\"&LEN(J83))),1)*1)","v":{"$error":"#REF!"}},{"$error":"#DIV/0!"},0]
[{"$nulls":8},{"v":0,"d":"0%"},null,{"$error":"#REF!"},"",0,0,0,0,0,0,0,0,0,0,{"$f":"SUM(MID(J84,ROW(INDIRECT(\"h1:H\"&LEN(J84))),1)*1)","v":{"$error":"#REF!"}},{"$error":"#DIV/0!"},0]
[{"$nulls":8},{"v":0,"d":"0%"},null,{"$error":"#REF!"},"",0,0,0,0,0,0,0,0,0,0,{"$f":"SUM(MID(J85,ROW(INDIRECT(\"h1:H\"&LEN(J85))),1)*1)","v":{"$error":"#REF!"}},{"$error":"#DIV/0!"},0]
[{"$nulls":8},{"v":0,"d":"0%"},null,{"$error":"#REF!"},"",0,0,0,0,0,0,0,0,0,0,{"$f":"SUM(MID(J86,ROW(INDIRECT(\"h1:H\"&LEN(J86))),1)*1)","v":{"$error":"#REF!"}},{"$error":"#DIV/0!"},0]
[{"$nulls":8},{"v":0,"d":"0%"},null,{"$error":"#REF!"},"",0,0,0,0,0,0,0,0,0,0,{"$f":"SUM(MID(J87,ROW(INDIRECT(\"h1:H\"&LEN(J87))),1)*1)","v":{"$error":"#REF!"}},{"$error":"#DIV/0!"},0]
[{"$nulls":8},{"v":0,"d":"0%"},null,{"$error":"#REF!"},"",0,0,0,0,0,0,0,0,0,0,{"$f":"SUM(MID(J88,ROW(INDIRECT(\"h1:H\"&LEN(J88))),1)*1)","v":{"$error":"#REF!"}},{"$error":"#DIV/0!"},0]
[{"$nulls":8},{"v":0,"d":"0%"},null,{"$error":"#REF!"},"",0,0,0,0,0,0,0,0,0,0,{"$f":"SUM(MID(J89,ROW(INDIRECT(\"h1:H\"&LEN(J89))),1)*1)","v":{"$error":"#REF!"}},{"$error":"#DIV/0!"},0]
[{"$nulls":8},{"v":0,"d":"0%"},null,{"$error":"#REF!"},"",0,0,0,0,0,0,0,0,0,0,{"$f":"SUM(MID(J90,ROW(INDIRECT(\"h1:H\"&LEN(J90))),1)*1)","v":{"$error":"#REF!"}},{"$error":"#DIV/0!"},0]
[{"$nulls":8},{"v":0,"d":"0%"},null,{"$error":"#REF!"},"",0,0,0,0,0,0,0,0,0,0,{"$f":"SUM(MID(J91,ROW(INDIRECT(\"h1:H\"&LEN(J91))),1)*1)","v":{"$error":"#REF!"}},{"$error":"#DIV/0!"},0]
[{"$nulls":8},{"v":0,"d":"0%"},null,{"$error":"#REF!"},"",0,0,0,0,0,0,0,0,0,0,{"$f":"SUM(MID(J92,ROW(INDIRECT(\"h1:H\"&LEN(J92))),1)*1)","v":{"$error":"#REF!"}},{"$error":"#DIV/0!"},0]
[{"$nulls":8},{"v":0,"d":"0%"},null,{"$error":"#REF!"},"",0,0,0,0,0,0,0,0,0,0,{"$f":"SUM(MID(J93,ROW(INDIRECT(\"h1:H\"&LEN(J93))),1)*1)","v":{"$error":"#REF!"}},{"$error":"#DIV/0!"},0]
[{"$nulls":8},{"v":0,"d":"0%"},null,{"$error":"#REF!"},"",0,0,0,0,0,0,0,0,0,0,{"$f":"SUM(MID(J94,ROW(INDIRECT(\"h1:H\"&LEN(J94))),1)*1)","v":{"$error":"#REF!"}},{"$error":"#DIV/0!"},0]
[{"$nulls":8},{"v":0,"d":"0%"},null,{"$error":"#REF!"},"",0,0,0,0,0,0,0,0,0,0,{"$f":"SUM(MID(J95,ROW(INDIRECT(\"h1:H\"&LEN(J95))),1)*1)","v":{"$error":"#REF!"}},{"$error":"#DIV/0!"},0]
[{"$nulls":8},{"v":0,"d":"0%"},null,{"$error":"#REF!"},"",0,0,0,0,0,0,0,0,0,0,{"$f":"SUM(MID(J96,ROW(INDIRECT(\"h1:H\"&LEN(J96))),1)*1)","v":{"$error":"#REF!"}},{"$error":"#DIV/0!"},0]
[{"$nulls":8},{"v":0,"d":"0%"},null,{"$error":"#REF!"},"",0,0,0,0,0,0,0,0,0,0,{"$f":"SUM(MID(J97,ROW(INDIRECT(\"h1:H\"&LEN(J97))),1)*1)","v":{"$error":"#REF!"}},{"$error":"#DIV/0!"},0]
[{"$nulls":8},{"v":0,"d":"0%"},null,{"$error":"#REF!"},"",0,0,0,0,0,0,0,0,0,0,{"$f":"SUM(MID(J98,ROW(INDIRECT(\"h1:H\"&LEN(J98))),1)*1)","v":{"$error":"#REF!"}},{"$error":"#DIV/0!"},0]
[{"$nulls":8},{"v":0,"d":"0%"},null,{"$error":"#REF!"},"",0,0,0,0,0,0,0,0,0,0,{"$f":"SUM(MID(J99,ROW(INDIRECT(\"h1:H\"&LEN(J99))),1)*1)","v":{"$error":"#REF!"}},{"$error":"#DIV/0!"},0]
[{"$nulls":8},{"v":0,"d":"0%"},null,{"$error":"#REF!"},"",0,0,0,0,0,0,0,0,0,0,{"$f":"SUM(MID(J100,ROW(INDIRECT(\"h1:H\"&LEN(J100))),1)*1)","v":{"$error":"#REF!"}},{"$error":"#DIV/0!"},0]
[{"$nulls":8},{"v":0,"d":"0%"},null,{"$error":"#REF!"},"",0,0,0,0,0,0,0,0,0,0,{"$f":"SUM(MID(J101,ROW(INDIRECT(\"h1:H\"&LEN(J101))),1)*1)","v":{"$error":"#REF!"}},{"$error":"#DIV/0!"},0]
[{"$nulls":8},{"v":0,"d":"0%"},null,{"$error":"#REF!"},"",0,0,0,0,0,0,0,0,0,0,{"$f":"SUM(MID(J102,ROW(INDIRECT(\"h1:H\"&LEN(J102))),1)*1)","v":{"$error":"#REF!"}},{"$error":"#DIV/0!"},0]
[{"$nulls":8},{"v":0,"d":"0%"},null,{"$error":"#REF!"},"",0,0,0,0,0,0,0,0,0,0,{"$f":"SUM(MID(J103,ROW(INDIRECT(\"h1:H\"&LEN(J103))),1)*1)","v":{"$error":"#REF!"}},{"$error":"#DIV/0!"},0]
[{"$nulls":8},{"v":0,"d":"0%"},null,{"$error":"#REF!"},"",0,0,0,0,0,0,0,0,0,0,{"$f":"SUM(MID(J104,ROW(INDIRECT(\"h1:H\"&LEN(J104))),1)*1)","v":{"$error":"#REF!"}},{"$error":"#DIV/0!"},0]
[{"$nulls":8},{"v":0,"d":"0%"},null,{"$error":"#REF!"},"",0,0,0,0,0,0,0,0,0,0,{"$f":"SUM(MID(J105,ROW(INDIRECT(\"h1:H\"&LEN(J105))),1)*1)","v":{"$error":"#REF!"}},{"$error":"#DIV/0!"},0]
[{"$nulls":8},{"v":0,"d":"0%"},null,{"$error":"#REF!"},"",0,0,0,0,0,0,0,0,0,0,{"$f":"SUM(MID(J106,ROW(INDIRECT(\"h1:H\"&LEN(J106))),1)*1)","v":{"$error":"#REF!"}},{"$error":"#DIV/0!"},0]
[{"$nulls":8},{"v":0,"d":"0%"},null,{"$error":"#REF!"},"",0,0,0,0,0,0,0,0,0,0,{"$f":"SUM(MID(J107,ROW(INDIRECT(\"h1:H\"&LEN(J107))),1)*1)","v":{"$error":"#REF!"}},{"$error":"#DIV/0!"},0]
[{"$nulls":8},{"v":0,"d":"0%"},null,{"$error":"#REF!"},"",0,0,0,0,0,0,0,0,0,0,{"$f":"SUM(MID(J108,ROW(INDIRECT(\"h1:H\"&LEN(J108))),1)*1)","v":{"$error":"#REF!"}},{"$error":"#DIV/0!"},0]
[{"$nulls":8},{"v":0,"d":"0%"},null,{"$error":"#REF!"},"",0,0,0,0,0,0,0,0,0,0,{"$f":"SUM(MID(J109,ROW(INDIRECT(\"h1:H\"&LEN(J109))),1)*1)","v":{"$error":"#REF!"}},{"$error":"#DIV/0!"},0]
[{"$nulls":8},{"v":0,"d":"0%"},null,{"$error":"#REF!"},"",0,0,0,0,0,0,0,0,0,0,{"$f":"SUM(MID(J110,ROW(INDIRECT(\"h1:H\"&LEN(J110))),1)*1)","v":{"$error":"#REF!"}},{"$error":"#DIV/0!"},0]
[{"$nulls":8},{"v":0,"d":"0%"},null,{"$error":"#REF!"},"",0,0,0,0,0,0,0,0,0,0,{"$f":"SUM(MID(J111,ROW(INDIRECT(\"h1:H\"&LEN(J111))),1)*1)","v":{"$error":"#REF!"}},{"$error":"#DIV/0!"},0]
[{"$nulls":8},{"v":0,"d":"0%"},null,{"$error":"#REF!"},"",0,0,0,0,0,0,0,0,0,0,{"$f":"SUM(MID(J112,ROW(INDIRECT(\"h1:H\"&LEN(J112))),1)*1)","v":{"$error":"#REF!"}},{"$error":"#DIV/0!"},0]
[{"$nulls":8},{"v":0,"d":"0%"},null,{"$error":"#REF!"},"",0,0,0,0,0,0,0,0,0,0,{"$f":"SUM(MID(J113,ROW(INDIRECT(\"h1:H\"&LEN(J113))),1)*1)","v":{"$error":"#REF!"}},{"$error":"#DIV/0!"},0]
[{"$nulls":8},{"v":0,"d":"0%"},null,{"$error":"#REF!"},"",0,0,0,0,0,0,0,0,0,0,{"$f":"SUM(MID(J114,ROW(INDIRECT(\"h1:H\"&LEN(J114))),1)*1)","v":{"$error":"#REF!"}},{"$error":"#DIV/0!"},0]
[{"$nulls":8},{"v":0,"d":"0%"},null,{"$error":"#REF!"},"",0,0,0,0,0,0,0,0,0,0,{"$f":"SUM(MID(J115,ROW(INDIRECT(\"h1:H\"&LEN(J115))),1)*1)","v":{"$error":"#REF!"}},{"$error":"#DIV/0!"},0]
[{"$nulls":8},{"v":0,"d":"0%"},null,{"$error":"#REF!"},"",0,0,0,0,0,0,0,0,0,0,{"$f":"SUM(MID(J116,ROW(INDIRECT(\"h1:H\"&LEN(J116))),1)*1)","v":{"$error":"#REF!"}},{"$error":"#DIV/0!"},0]
[{"$nulls":8},{"v":0,"d":"0%"},null,{"$error":"#REF!"},"",0,0,0,0,0,0,0,0,0,0,{"$f":"SUM(MID(J117,ROW(INDIRECT(\"h1:H\"&LEN(J117))),1)*1)","v":{"$error":"#REF!"}},{"$error":"#DIV/0!"},0]
[{"$nulls":8},{"v":0,"d":"0%"},null,{"$error":"#REF!"},"",0,0,0,0,0,0,0,0,0,0,{"$f":"SUM(MID(J118,ROW(INDIRECT(\"h1:H\"&LEN(J118))),1)*1)","v":{"$error":"#REF!"}},{"$error":"#DIV/0!"},0]
[{"$nulls":8},{"v":0,"d":"0%"},null,{"$error":"#REF!"},"",0,0,0,0,0,0,0,0,0,0,{"$f":"SUM(MID(J119,ROW(INDIRECT(\"h1:H\"&LEN(J119))),1)*1)","v":{"$error":"#REF!"}},{"$error":"#DIV/0!"},0]
[{"$nulls":8},{"v":0,"d":"0%"},null,{"$error":"#REF!"},"",0,0,0,0,0,0,0,0,0,0,{"$f":"SUM(MID(J120,ROW(INDIRECT(\"h1:H\"&LEN(J120))),1)*1)","v":{"$error":"#REF!"}},{"$error":"#DIV/0!"},0]
[{"$nulls":8},{"v":0,"d":"0%"},null,{"$error":"#REF!"},"",0,0,0,0,0,0,0,0,0,0,{"$f":"SUM(MID(J121,ROW(INDIRECT(\"h1:H\"&LEN(J121))),1)*1)","v":{"$error":"#REF!"}},{"$error":"#DIV/0!"},0]
[{"$nulls":8},{"v":0,"d":"0%"},null,{"$error":"#REF!"},"",0,0,0,0,0,0,0,0,0,0,{"$f":"SUM(MID(J122,ROW(INDIRECT(\"h1:H\"&LEN(J122))),1)*1)","v":{"$error":"#REF!"}},{"$error":"#DIV/0!"},0]
[{"$nulls":8},{"v":0,"d":"0%"},null,{"$error":"#REF!"},"",0,0,0,0,0,0,0,0,0,0,{"$f":"SUM(MID(J123,ROW(INDIRECT(\"h1:H\"&LEN(J123))),1)*1)","v":{"$error":"#REF!"}},{"$error":"#DIV/0!"},0]
[{"$nulls":8},{"v":0,"d":"0%"},null,{"$error":"#REF!"},"",0,0,0,0,0,0,0,0,0,0,{"$f":"SUM(MID(J124,ROW(INDIRECT(\"h1:H\"&LEN(J124))),1)*1)","v":{"$error":"#REF!"}},{"$error":"#DIV/0!"},0]
[{"$nulls":8},{"v":0,"d":"0%"},null,{"$error":"#REF!"},"",0,0,0,0,0,0,0,0,0,0,{"$f":"SUM(MID(J125,ROW(INDIRECT(\"h1:H\"&LEN(J125))),1)*1)","v":{"$error":"#REF!"}},{"$error":"#DIV/0!"},0]
[{"$nulls":8},{"v":0,"d":"0%"},null,{"$error":"#REF!"},"",0,0,0,0,0,0,0,0,0,0,{"$f":"SUM(MID(J126,ROW(INDIRECT(\"h1:H\"&LEN(J126))),1)*1)","v":{"$error":"#REF!"}},{"$error":"#DIV/0!"},0]
[{"$nulls":8},{"v":0,"d":"0%"},null,{"$error":"#REF!"},"",0,0,0,0,0,0,0,0,0,0,{"$f":"SUM(MID(J127,ROW(INDIRECT(\"h1:H\"&LEN(J127))),1)*1)","v":{"$error":"#REF!"}},{"$error":"#DIV/0!"},0]
[{"$nulls":8},{"v":0,"d":"0%"},null,{"$error":"#REF!"},"",0,0,{"$f":"M128-LEN(SUBSTITUTE(J128,\"1\",\"\"))+P128","v":0},0,0,0,0,0,0,0,{"$f":"SUM(MID(J128,ROW(INDIRECT(\"h1:H\"&LEN(J128))),1)*1)","v":{"$error":"#REF!"}},{"$error":"#DIV/0!"},0]
[{"$nulls":8},{"v":0,"d":"0%"},null,{"$error":"#REF!"},"",0,0,{"$f":"M129-LEN(SUBSTITUTE(J129,\"1\",\"\"))+P129","v":0},0,0,0,0,0,0,0,{"$f":"SUM(MID(J129,ROW(INDIRECT(\"h1:H\"&LEN(J129))),1)*1)","v":{"$error":"#REF!"}},{"$error":"#DIV/0!"},0]
[{"$nulls":8},{"v":0,"d":"0%"},null,{"$error":"#REF!"},"",0,0,0,0,0,0,0,0,0,0,{"$f":"SUM(MID(J130,ROW(INDIRECT(\"h1:H\"&LEN(J130))),1)*1)","v":{"$error":"#REF!"}},{"$error":"#DIV/0!"},0]
[{"$nulls":8},{"v":0,"d":"0%"},null,{"$error":"#REF!"},"",0,0,0,0,0,0,0,0,0,0,{"$f":"SUM(MID(J131,ROW(INDIRECT(\"h1:H\"&LEN(J131))),1)*1)","v":{"$error":"#REF!"}},{"$error":"#DIV/0!"},0]
[{"$nulls":8},{"v":0,"d":"0%"},null,{"$error":"#REF!"},"",0,0,0,0,0,0,0,0,0,0,{"$f":"SUM(MID(J132,ROW(INDIRECT(\"h1:H\"&LEN(J132))),1)*1)","v":{"$error":"#REF!"}},{"$error":"#DIV/0!"},0]
[{"$nulls":8},{"v":0,"d":"0%"},null,{"$error":"#REF!"},"",0,0,0,0,0,0,0,0,0,0,{"$f":"SUM(MID(J133,ROW(INDIRECT(\"h1:H\"&LEN(J133))),1)*1)","v":{"$error":"#REF!"}},{"$error":"#DIV/0!"},0]
[{"$nulls":8},{"v":0,"d":"0%"},null,{"$error":"#REF!"},"",0,0,0,0,0,0,0,0,0,0,{"$f":"SUM(MID(J134,ROW(INDIRECT(\"h1:H\"&LEN(J134))),1)*1)","v":{"$error":"#REF!"}},{"$error":"#DIV/0!"},0]
[{"$nulls":8},{"v":0,"d":"0%"},null,{"$f":"IF(W135=E135,\"OK\",\"Falsch\")","v":{"$error":"#REF!"}},"",{"$f":"LEN(J135)","v":0},0,0,0,{"$f":"M135-LEN(SUBSTITUTE(J135,\"0\",\"\"))","v":0},{"$f":"I135*M135","v":0},0,{"$f":"M135-(M135-(LEN(J135)-LEN(SUBSTITUTE(J135,\"3\",\"\"))))+M135-(M135-(LEN(J135)-LEN(SUBSTITUTE(J135,\"5\",\"\"))))","v":0},0,{"$f":"M135-(M135-(LEN(J135)-LEN(SUBSTITUTE(J135,\"4\",\"\"))))+M135-(M135-(LEN(J135)-LEN(SUBSTITUTE(J135,\"5\",\"\"))))","v":0},{"$f":"SUM(MID(J135,ROW(INDIRECT(\"h1:H\"&LEN(J135))),1)*1)","v":{"$error":"#REF!"}},{"$error":"#DIV/0!"},0]
[{"$nulls":8},{"v":0,"d":"0%"},null,{"$error":"#REF!"},{"$f":"IF(H136=0,\"\",IF(M136=H136,\"OK\",\"Falsch\"))","v":""},0,{"$f":"M136-(M136-LEN(SUBSTITUTE(J136,\"0\",\"\")))-(M136-LEN(SUBSTITUTE(J136,\"1\",\"\")))-P136","v":0},0,{"$f":"IF($Z$7=\"J\",(M136-LEN(SUBSTITUTE(J136,\"42\",\"\")))/2+(M136-LEN(SUBSTITUTE(J136,\"222\",\"\")))/3,0)","v":0},0,0,{"$f":"ROUND(R136,0)","v":0},0,{"$f":"S136-T136","v":0},0,{"$f":"SUM(MID(J136,ROW(INDIRECT(\"h1:H\"&LEN(J136))),1)*1)","v":{"$error":"#REF!"}},{"$f":"F136/D136","v":{"$error":"#DIV/0!"}},{"$f":"F136-D136","v":0}]
[{"$nulls":8},{"v":0,"d":"0%"},null,{"$error":"#REF!"},"",0,0,0,0,0,0,0,0,0,0,{"$f":"SUM(MID(J137,ROW(INDIRECT(\"h1:H\"&LEN(J137))),1)*1)","v":{"$error":"#REF!"}},{"$error":"#DIV/0!"},0]
[{"$nulls":8},{"v":0,"d":"0%"},null,{"$error":"#REF!"},"",0,0,0,0,0,0,0,0,0,0,{"$f":"SUM(MID(J138,ROW(INDIRECT(\"h1:H\"&LEN(J138))),1)*1)","v":{"$error":"#REF!"}},{"$error":"#DIV/0!"},0]
[{"$nulls":8},{"v":0,"d":"0%"},null,{"$error":"#REF!"},"",0,0,0,0,0,0,0,0,0,0,{"$f":"SUM(MID(J139,ROW(INDIRECT(\"h1:H\"&LEN(J139))),1)*1)","v":{"$error":"#REF!"}},{"$error":"#DIV/0!"},0]
[{"$nulls":8},{"v":0,"d":"0%"},null,{"$error":"#REF!"},"",0,0,0,0,0,0,0,0,0,0,{"$f":"SUM(MID(J140,ROW(INDIRECT(\"h1:H\"&LEN(J140))),1)*1)","v":{"$error":"#REF!"}},{"$error":"#DIV/0!"},0]
[{"$nulls":8},{"v":0,"d":"0%"},null,{"$error":"#REF!"},"",0,0,0,0,0,0,0,0,0,0,{"$f":"SUM(MID(J141,ROW(INDIRECT(\"h1:H\"&LEN(J141))),1)*1)","v":{"$error":"#REF!"}},{"$error":"#DIV/0!"},0]
[{"$nulls":8},{"v":0,"d":"0%"},null,{"$error":"#REF!"},"",0,0,0,0,0,0,0,0,0,0,{"$f":"SUM(MID(J142,ROW(INDIRECT(\"h1:H\"&LEN(J142))),1)*1)","v":{"$error":"#REF!"}},{"$error":"#DIV/0!"},0]
[{"$nulls":8},{"v":0,"d":"0%"},null,{"$error":"#REF!"},"",0,0,0,0,0,0,0,0,0,0,{"$f":"SUM(MID(J143,ROW(INDIRECT(\"h1:H\"&LEN(J143))),1)*1)","v":{"$error":"#REF!"}},{"$error":"#DIV/0!"},0]
[{"$nulls":8},{"v":0,"d":"0%"},null,{"$error":"#REF!"},"",0,0,0,0,0,0,0,0,0,0,{"$f":"SUM(MID(J144,ROW(INDIRECT(\"h1:H\"&LEN(J144))),1)*1)","v":{"$error":"#REF!"}},{"$error":"#DIV/0!"},0]
[{"$nulls":8},{"v":0,"d":"0%"},null,{"$error":"#REF!"},"",0,0,0,0,0,0,0,0,0,0,{"$f":"SUM(MID(J145,ROW(INDIRECT(\"h1:H\"&LEN(J145))),1)*1)","v":{"$error":"#REF!"}},{"$error":"#DIV/0!"},0]
[{"$nulls":8},{"v":0,"d":"0%"},null,{"$error":"#REF!"},"",0,0,0,0,0,0,0,0,0,0,{"$f":"SUM(MID(J146,ROW(INDIRECT(\"h1:H\"&LEN(J146))),1)*1)","v":{"$error":"#REF!"}},{"$error":"#DIV/0!"},0]
[{"$nulls":8},{"v":0,"d":"0%"},null,{"$error":"#REF!"},"",0,0,0,0,0,0,0,0,0,0,{"$f":"SUM(MID(J147,ROW(INDIRECT(\"h1:H\"&LEN(J147))),1)*1)","v":{"$error":"#REF!"}},{"$error":"#DIV/0!"},0]
[{"$nulls":8},{"v":0,"d":"0%"},null,{"$error":"#REF!"},"",0,0,0,0,0,0,0,0,0,0,{"$f":"SUM(MID(J148,ROW(INDIRECT(\"h1:H\"&LEN(J148))),1)*1)","v":{"$error":"#REF!"}},{"$error":"#DIV/0!"},0]
[{"$nulls":8},{"v":0,"d":"0%"},null,{"$error":"#REF!"},"",0,0,0,0,0,0,0,0,0,0,{"$f":"SUM(MID(J149,ROW(INDIRECT(\"h1:H\"&LEN(J149))),1)*1)","v":{"$error":"#REF!"}},{"$error":"#DIV/0!"},0]
[{"$nulls":8},{"v":0,"d":"0%"},null,{"$error":"#REF!"},"",0,0,0,0,0,0,0,0,0,0,{"$f":"SUM(MID(J150,ROW(INDIRECT(\"h1:H\"&LEN(J150))),1)*1)","v":{"$error":"#REF!"}},{"$error":"#DIV/0!"},0]
[{"$nulls":8},{"v":0,"d":"0%"},null,{"$error":"#REF!"},"",0,0,0,0,0,0,0,0,0,0,{"$f":"SUM(MID(J151,ROW(INDIRECT(\"h1:H\"&LEN(J151))),1)*1)","v":{"$error":"#REF!"}},{"$error":"#DIV/0!"},0]
[{"$nulls":8},{"v":0,"d":"0%"},null,{"$error":"#REF!"},"",0,0,0,0,0,0,0,0,0,0,{"$f":"SUM(MID(J152,ROW(INDIRECT(\"h1:H\"&LEN(J152))),1)*1)","v":{"$error":"#REF!"}},{"$error":"#DIV/0!"},0]
[{"$nulls":8},{"v":0,"d":"0%"},null,{"$error":"#REF!"},"",0,0,0,0,0,0,0,0,0,0,{"$f":"SUM(MID(J153,ROW(INDIRECT(\"h1:H\"&LEN(J153))),1)*1)","v":{"$error":"#REF!"}},{"$error":"#DIV/0!"},0]
[{"$nulls":8},{"v":0,"d":"0%"},null,{"$error":"#REF!"},"",0,0,0,0,0,0,0,0,0,0,{"$f":"SUM(MID(J154,ROW(INDIRECT(\"h1:H\"&LEN(J154))),1)*1)","v":{"$error":"#REF!"}},{"$error":"#DIV/0!"},0]
[{"$nulls":8},{"v":0,"d":"0%"},null,{"$error":"#REF!"},"",0,0,0,0,0,0,0,0,0,0,{"$f":"SUM(MID(J155,ROW(INDIRECT(\"h1:H\"&LEN(J155))),1)*1)","v":{"$error":"#REF!"}},{"$error":"#DIV/0!"},0]
[{"$nulls":8},{"v":0,"d":"0%"},null,{"$error":"#REF!"},"",0,0,0,0,0,0,0,0,0,0,{"$f":"SUM(MID(J156,ROW(INDIRECT(\"h1:H\"&LEN(J156))),1)*1)","v":{"$error":"#REF!"}},{"$error":"#DIV/0!"},0]
[{"$nulls":8},{"v":0,"d":"0%"},null,{"$error":"#REF!"},"",0,0,0,0,0,0,0,0,0,0,{"$f":"SUM(MID(J157,ROW(INDIRECT(\"h1:H\"&LEN(J157))),1)*1)","v":{"$error":"#REF!"}},{"$error":"#DIV/0!"},0]
[{"$nulls":8},{"v":0,"d":"0%"},null,{"$error":"#REF!"},"",0,0,0,0,0,0,0,0,0,0,{"$f":"SUM(MID(J158,ROW(INDIRECT(\"h1:H\"&LEN(J158))),1)*1)","v":{"$error":"#REF!"}},{"$error":"#DIV/0!"},0]
[{"$nulls":8},{"v":0,"d":"0%"},null,{"$error":"#REF!"},"",0,0,0,0,0,0,0,0,0,0,{"$f":"SUM(MID(J159,ROW(INDIRECT(\"h1:H\"&LEN(J159))),1)*1)","v":{"$error":"#REF!"}},{"$error":"#DIV/0!"},0]
[{"$nulls":8},{"v":0,"d":"0%"},null,{"$error":"#REF!"},"",0,0,0,0,0,0,0,0,0,0,{"$f":"SUM(MID(J160,ROW(INDIRECT(\"h1:H\"&LEN(J160))),1)*1)","v":{"$error":"#REF!"}},{"$error":"#DIV/0!"},0]
[{"$nulls":8},{"v":0,"d":"0%"},null,{"$error":"#REF!"},"",0,0,0,0,0,0,0,0,0,0,{"$f":"SUM(MID(J161,ROW(INDIRECT(\"h1:H\"&LEN(J161))),1)*1)","v":{"$error":"#REF!"}},{"$error":"#DIV/0!"},0]
[{"$nulls":8},{"v":0,"d":"0%"},null,{"$error":"#REF!"},"",0,0,0,0,0,0,0,0,0,0,{"$f":"SUM(MID(J162,ROW(INDIRECT(\"h1:H\"&LEN(J162))),1)*1)","v":{"$error":"#REF!"}},{"$error":"#DIV/0!"},0]
[{"$nulls":8},{"v":0,"d":"0%"},null,{"$error":"#REF!"},"",0,0,0,0,0,0,0,0,0,0,{"$f":"SUM(MID(J163,ROW(INDIRECT(\"h1:H\"&LEN(J163))),1)*1)","v":{"$error":"#REF!"}},{"$error":"#DIV/0!"},0]
[158,"",{"$nulls":6},{"v":0,"d":"0%"},null,{"$error":"#REF!"},"",0,0,0,0,0,0,0,0,0,0,{"$f":"SUM(MID(J164,ROW(INDIRECT(\"h1:H\"&LEN(J164))),1)*1)","v":{"$error":"#REF!"}},{"$error":"#DIV/0!"},0]
[159,"",{"$nulls":6},{"v":0,"d":"0%"},null,{"$error":"#REF!"},"",0,0,0,0,0,0,0,0,0,0,{"$f":"SUM(MID(J165,ROW(INDIRECT(\"h1:H\"&LEN(J165))),1)*1)","v":{"$error":"#REF!"}},{"$error":"#DIV/0!"},0]
[160,"",{"$nulls":6},{"v":0,"d":"0%"},null,{"$error":"#REF!"},"",0,0,0,0,0,0,0,0,0,0,{"$f":"SUM(MID(J166,ROW(INDIRECT(\"h1:H\"&LEN(J166))),1)*1)","v":{"$error":"#REF!"}},{"$error":"#DIV/0!"},0]
[161,"",{"$nulls":6},{"v":0,"d":"0%"},null,{"$error":"#REF!"},"",0,0,0,0,0,0,0,0,0,0,{"$f":"SUM(MID(J167,ROW(INDIRECT(\"h1:H\"&LEN(J167))),1)*1)","v":{"$error":"#REF!"}},{"$error":"#DIV/0!"},0]
[162,"",{"$nulls":6},{"v":0,"d":"0%"},null,{"$error":"#REF!"},"",0,0,0,0,0,0,0,0,0,0,{"$f":"SUM(MID(J168,ROW(INDIRECT(\"h1:H\"&LEN(J168))),1)*1)","v":{"$error":"#REF!"}},{"$error":"#DIV/0!"},0]
[163,"",{"$nulls":6},{"v":0,"d":"0%"},null,{"$error":"#REF!"},"",0,0,0,0,0,0,0,0,0,0,{"$f":"SUM(MID(J169,ROW(INDIRECT(\"h1:H\"&LEN(J169))),1)*1)","v":{"$error":"#REF!"}},{"$error":"#DIV/0!"},0]
[164,"",{"$nulls":6},{"v":0,"d":"0%"},null,{"$error":"#REF!"},"",0,0,0,0,0,0,0,0,0,0,{"$f":"SUM(MID(J170,ROW(INDIRECT(\"h1:H\"&LEN(J170))),1)*1)","v":{"$error":"#REF!"}},{"$error":"#DIV/0!"},0]
[165,"",{"$nulls":6},{"v":0,"d":"0%"},null,{"$error":"#REF!"},"",0,0,0,0,0,0,0,0,0,0,{"$f":"SUM(MID(J171,ROW(INDIRECT(\"h1:H\"&LEN(J171))),1)*1)","v":{"$error":"#REF!"}},{"$error":"#DIV/0!"},0]
[166,"",{"$nulls":6},{"v":0,"d":"0%"},null,{"$error":"#REF!"},"",0,0,0,0,0,0,0,0,0,0,{"$f":"SUM(MID(J172,ROW(INDIRECT(\"h1:H\"&LEN(J172))),1)*1)","v":{"$error":"#REF!"}},{"$error":"#DIV/0!"},0]
[167,"",{"$nulls":6},{"v":0,"d":"0%"},null,{"$error":"#REF!"},"",0,0,0,0,0,0,0,0,0,0,{"$f":"SUM(MID(J173,ROW(INDIRECT(\"h1:H\"&LEN(J173))),1)*1)","v":{"$error":"#REF!"}},{"$error":"#DIV/0!"},0]
[168,"",{"$nulls":6},{"v":0,"d":"0%"},null,{"$error":"#REF!"},"",0,0,0,0,0,0,0,0,0,0,{"$f":"SUM(MID(J174,ROW(INDIRECT(\"h1:H\"&LEN(J174))),1)*1)","v":{"$error":"#REF!"}},{"$error":"#DIV/0!"},0]
[169,"",{"$nulls":6},{"v":0,"d":"0%"},null,{"$error":"#REF!"},"",0,0,0,0,0,0,0,0,0,0,{"$f":"SUM(MID(J175,ROW(INDIRECT(\"h1:H\"&LEN(J175))),1)*1)","v":{"$error":"#REF!"}},{"$error":"#DIV/0!"},0]
[170,"",{"$nulls":6},{"v":0,"d":"0%"},null,{"$error":"#REF!"},"",0,0,0,0,0,0,0,0,0,0,{"$f":"SUM(MID(J176,ROW(INDIRECT(\"h1:H\"&LEN(J176))),1)*1)","v":{"$error":"#REF!"}},{"$error":"#DIV/0!"},0]
[171,"",{"$nulls":6},{"v":0,"d":"0%"},null,{"$error":"#REF!"},"",0,0,0,0,0,0,0,0,0,0,{"$f":"SUM(MID(J177,ROW(INDIRECT(\"h1:H\"&LEN(J177))),1)*1)","v":{"$error":"#REF!"}},{"$error":"#DIV/0!"},0]
[172,"",{"$nulls":6},{"v":0,"d":"0%"},null,{"$error":"#REF!"},"",0,0,0,0,0,0,0,0,0,0,{"$f":"SUM(MID(J178,ROW(INDIRECT(\"h1:H\"&LEN(J178))),1)*1)","v":{"$error":"#REF!"}},{"$error":"#DIV/0!"},0]
[173,"",{"$nulls":6},{"v":0,"d":"0%"},null,{"$error":"#REF!"},"",0,0,0,0,0,0,0,0,0,0,{"$f":"SUM(MID(J179,ROW(INDIRECT(\"h1:H\"&LEN(J179))),1)*1)","v":{"$error":"#REF!"}},{"$error":"#DIV/0!"},0]
[174,"",{"$nulls":6},{"v":0,"d":"0%"},null,{"$error":"#REF!"},"",0,0,0,0,0,0,0,0,0,0,{"$f":"SUM(MID(J180,ROW(INDIRECT(\"h1:H\"&LEN(J180))),1)*1)","v":{"$error":"#REF!"}},{"$error":"#DIV/0!"},0]
[175,"",{"$nulls":6},{"v":0,"d":"0%"},null,{"$error":"#REF!"},"",0,0,0,0,0,0,0,0,0,0,{"$f":"SUM(MID(J181,ROW(INDIRECT(\"h1:H\"&LEN(J181))),1)*1)","v":{"$error":"#REF!"}},{"$error":"#DIV/0!"},0]
[176,{"$nulls":7},{"v":0,"d":"0%"},null,{"$error":"#REF!"},"",0,0,0,0,0,0,0,0,0,0,{"$f":"SUM(MID(J182,ROW(INDIRECT(\"h1:H\"&LEN(J182))),1)*1)","v":{"$error":"#REF!"}},{"$error":"#DIV/0!"},0]
[177,{"$nulls":7},{"v":0,"d":"0%"},null,{"$error":"#REF!"},"",0,0,0,0,0,0,0,0,0,0,{"$f":"SUM(MID(J183,ROW(INDIRECT(\"h1:H\"&LEN(J183))),1)*1)","v":{"$error":"#REF!"}},{"$error":"#DIV/0!"},0]
[178,{"$nulls":7},{"v":0,"d":"0%"},null,{"$error":"#REF!"},"",0,0,0,0,0,0,0,0,0,0,{"$f":"SUM(MID(J184,ROW(INDIRECT(\"h1:H\"&LEN(J184))),1)*1)","v":{"$error":"#REF!"}},{"$error":"#DIV/0!"},0]
[179,{"$nulls":7},{"v":0,"d":"0%"},null,{"$error":"#REF!"},"",0,0,0,0,0,0,0,0,0,0,{"$f":"SUM(MID(J185,ROW(INDIRECT(\"h1:H\"&LEN(J185))),1)*1)","v":{"$error":"#REF!"}},{"$error":"#DIV/0!"},0]
[180,{"$nulls":7},{"v":0,"d":"0%"},null,{"$error":"#REF!"},"",0,0,0,0,0,0,0,0,0,0,{"$f":"SUM(MID(J186,ROW(INDIRECT(\"h1:H\"&LEN(J186))),1)*1)","v":{"$error":"#REF!"}},{"$error":"#DIV/0!"},0]
[181,{"$nulls":7},{"v":0,"d":"0%"},null,{"$error":"#REF!"},"",0,0,0,0,0,0,0,0,0,0,{"$f":"SUM(MID(J187,ROW(INDIRECT(\"h1:H\"&LEN(J187))),1)*1)","v":{"$error":"#REF!"}},{"$error":"#DIV/0!"},0]
[182,{"$nulls":7},{"v":0,"d":"0%"},null,{"$error":"#REF!"},"",0,0,0,0,0,0,0,0,0,0,{"$f":"SUM(MID(J188,ROW(INDIRECT(\"h1:H\"&LEN(J188))),1)*1)","v":{"$error":"#REF!"}},{"$error":"#DIV/0!"},0]
[183,{"$nulls":7},{"v":0,"d":"0%"},null,{"$error":"#REF!"},"",0,0,0,0,0,0,0,0,0,0,{"$f":"SUM(MID(J189,ROW(INDIRECT(\"h1:H\"&LEN(J189))),1)*1)","v":{"$error":"#REF!"}},{"$error":"#DIV/0!"},0]
[184,{"$nulls":7},{"v":0,"d":"0%"},null,{"$error":"#REF!"},"",0,0,0,0,0,0,0,0,0,0,{"$f":"SUM(MID(J190,ROW(INDIRECT(\"h1:H\"&LEN(J190))),1)*1)","v":{"$error":"#REF!"}},{"$error":"#DIV/0!"},0]
[185,{"$nulls":7},{"v":0,"d":"0%"},null,{"$error":"#REF!"},"",0,0,0,0,0,0,0,0,0,0,{"$f":"SUM(MID(J191,ROW(INDIRECT(\"h1:H\"&LEN(J191))),1)*1)","v":{"$error":"#REF!"}},{"$error":"#DIV/0!"},0]
[186,{"$nulls":7},{"v":0,"d":"0%"},null,{"$error":"#REF!"},"",0,0,0,0,0,0,0,0,0,0,{"$f":"SUM(MID(J192,ROW(INDIRECT(\"h1:H\"&LEN(J192))),1)*1)","v":{"$error":"#REF!"}},{"$error":"#DIV/0!"},0]
[187,{"$nulls":7},{"v":0,"d":"0%"},null,{"$error":"#REF!"},"",0,0,{"$f":"M193-LEN(SUBSTITUTE(J193,\"1\",\"\"))+P193","v":0},0,0,0,0,0,0,0,{"$f":"SUM(MID(J193,ROW(INDIRECT(\"h1:H\"&LEN(J193))),1)*1)","v":{"$error":"#REF!"}},{"$error":"#DIV/0!"},0]
[188,{"$nulls":7},{"v":0,"d":"0%"},null,{"$error":"#REF!"},"",0,0,0,0,0,0,0,0,0,0,{"$f":"SUM(MID(J194,ROW(INDIRECT(\"h1:H\"&LEN(J194))),1)*1)","v":{"$error":"#REF!"}},{"$error":"#DIV/0!"},0]
[189,{"$nulls":7},{"v":0,"d":"0%"},null,{"$error":"#REF!"},"",0,0,0,0,0,0,0,0,0,0,{"$f":"SUM(MID(J195,ROW(INDIRECT(\"h1:H\"&LEN(J195))),1)*1)","v":{"$error":"#REF!"}},{"$error":"#DIV/0!"},0]
[190,{"$nulls":7},{"v":0,"d":"0%"},null,{"$error":"#REF!"},"",0,0,0,0,0,0,0,0,0,0,{"$f":"SUM(MID(J196,ROW(INDIRECT(\"h1:H\"&LEN(J196))),1)*1)","v":{"$error":"#REF!"}},{"$error":"#DIV/0!"},0]
[191,{"$nulls":7},{"v":0,"d":"0%"},null,{"$error":"#REF!"},"",0,0,0,0,0,0,0,0,0,0,{"$f":"SUM(MID(J197,ROW(INDIRECT(\"h1:H\"&LEN(J197))),1)*1)","v":{"$error":"#REF!"}},{"$error":"#DIV/0!"},0]
[192,{"$nulls":7},{"v":0,"d":"0%"},null,{"$error":"#REF!"},"",0,0,0,0,0,0,0,0,0,0,{"$f":"SUM(MID(J198,ROW(INDIRECT(\"h1:H\"&LEN(J198))),1)*1)","v":{"$error":"#REF!"}},{"$error":"#DIV/0!"},0]
[193,{"$nulls":7},{"v":0,"d":"0%"},null,{"$f":"IF(W199=E199,\"OK\",\"Falsch\")","v":{"$error":"#REF!"}},"",{"$f":"LEN(J199)","v":0},0,0,0,{"$f":"M199-LEN(SUBSTITUTE(J199,\"0\",\"\"))","v":0},{"$f":"I199*M199","v":0},0,{"$f":"M199-(M199-(LEN(J199)-LEN(SUBSTITUTE(J199,\"3\",\"\"))))+M199-(M199-(LEN(J199)-LEN(SUBSTITUTE(J199,\"5\",\"\"))))","v":0},0,{"$f":"M199-(M199-(LEN(J199)-LEN(SUBSTITUTE(J199,\"4\",\"\"))))+M199-(M199-(LEN(J199)-LEN(SUBSTITUTE(J199,\"5\",\"\"))))","v":0},{"$f":"SUM(MID(J199,ROW(INDIRECT(\"h1:H\"&LEN(J199))),1)*1)","v":{"$error":"#REF!"}},{"$error":"#DIV/0!"},0]
[194,{"$nulls":7},{"v":0,"d":"0%"},null,{"$error":"#REF!"},{"$f":"IF(H200=0,\"\",IF(M200=H200,\"OK\",\"Falsch\"))","v":""},0,{"$f":"M200-(M200-LEN(SUBSTITUTE(J200,\"0\",\"\")))-(M200-LEN(SUBSTITUTE(J200,\"1\",\"\")))-P200","v":0},0,{"$f":"IF($Z$7=\"J\",(M200-LEN(SUBSTITUTE(J200,\"42\",\"\")))/2+(M200-LEN(SUBSTITUTE(J200,\"222\",\"\")))/3,0)","v":0},0,0,{"$f":"ROUND(R200,0)","v":0},0,{"$f":"S200-T200","v":0},0,{"$f":"SUM(MID(J200,ROW(INDIRECT(\"h1:H\"&LEN(J200))),1)*1)","v":{"$error":"#REF!"}},{"$f":"F200/D200","v":{"$error":"#DIV/0!"}},{"$f":"F200-D200","v":0}]
[195,{"$nulls":7},{"v":0,"d":"0%"},null,{"$error":"#REF!"},"",0,0,0,0,0,0,0,0,0,0,{"$f":"SUM(MID(J201,ROW(INDIRECT(\"h1:H\"&LEN(J201))),1)*1)","v":{"$error":"#REF!"}},{"$error":"#DIV/0!"},0]
[196,{"$nulls":7},{"v":0,"d":"0%"},null,{"$error":"#REF!"},"",0,0,0,0,0,0,0,0,0,0,{"$f":"SUM(MID(J202,ROW(INDIRECT(\"h1:H\"&LEN(J202))),1)*1)","v":{"$error":"#REF!"}},{"$error":"#DIV/0!"},0]
[197,{"$nulls":7},{"v":0,"d":"0%"},null,{"$error":"#REF!"},"",0,0,0,0,0,0,0,0,0,0,{"$f":"SUM(MID(J203,ROW(INDIRECT(\"h1:H\"&LEN(J203))),1)*1)","v":{"$error":"#REF!"}},{"$error":"#DIV/0!"},0]
[198,{"$nulls":7},{"v":0,"d":"0%"},null,{"$error":"#REF!"},"",0,0,0,0,0,0,0,0,0,0,{"$f":"SUM(MID(J204,ROW(INDIRECT(\"h1:H\"&LEN(J204))),1)*1)","v":{"$error":"#REF!"}},{"$error":"#DIV/0!"},0]
[199,{"$nulls":7},{"v":0,"d":"0%"},null,{"$error":"#REF!"},"",0,0,0,0,0,0,0,0,0,0,{"$f":"SUM(MID(J205,ROW(INDIRECT(\"h1:H\"&LEN(J205))),1)*1)","v":{"$error":"#REF!"}},{"$error":"#DIV/0!"},0]
[200,{"$nulls":7},{"v":0,"d":"0%"},null,{"$error":"#REF!"},"",0,0,0,0,0,0,0,0,0,0,{"$f":"SUM(MID(J206,ROW(INDIRECT(\"h1:H\"&LEN(J206))),1)*1)","v":{"$error":"#REF!"}},{"$error":"#DIV/0!"},0]

{"sheet":"Hilfe","index":3,"n_rows":18,"n_cols":2,"rows_kept":18}
["Mit dieser Tabelle kann ein Lichess Turnier erfasst werden."]
["1.) Die CSV Daten des Turniers herunterladen."]
["2.) Neue leere Excelmappe erstellen. / Diese öffnen. / Register Daten wählen Aus Text/CSV wählen"]
["3.)Die CSV Datei anwählen /importieren /Daten transformieren Speichern und importieren. "]
["4.) Das Blatt ist jetzt als Excel Blatt in dieser Tabelle."]
["5.)Alle Daten ausser Kopfzeile markieren( Ctrl-c) Kopieren drücken. Zu Tabelle Lichess Turnier erfassen wechseln/ Zelle A2 auswählen Inhalte einfügen: Werte wählen!"]
["Alle Daten sollten jetzt im Blatt lichess Turnier sein."]
["6.) Jetzt müssen nur noch die Grünen Zellen für jeden Spieler ausgefüllt werden."]
[null,"Wer sich die Arbeit erleichtern will installiert eine Text Scanner App wie (Barcode Manager for Education)"]
[null,"Mit dem Snipping Tool alle 10 sichtbaren Spielresultate in ein jpg ausschneiden und speichern Mit der Scanner App das Bild scannen"]
[null,"Die Zwischenablage direkt ins Excel Kopieren wichtig nur die Werte einfügen damit die Formatierung im Excel bestehen bleibt."]
["7.)Die CSV Tabelle und die neue Arbeitsmappe können gelöscht werden."]
["8.) Die Lichess erfassen Tabelle mit speichern unter neuem Namen abspeichern."]
[]
["Wenn die Sortierfilter verwendet werden soll,muss das Blatt entsperrt werden."]
["Register überprüfen wählen Blattschutz aufheben. Jetzt füktioniert das Sortieren."]
["Wichtig die Formeln sind jetzt nicht mehr geschützt. Keine Formelzellen verändern!!  (Die roten und gelben Spalten)"]
["Nach dem Sortieren den Normalansicht Knopf drücken das Blatt wird wieder gesperrt."]